{"text_format":"1","workbook":"xlsx","n_sheets":4,"sheets":["Instructions","TEQ","BIDLIST","Alphabetical"],"not_rendered":{"charts":0,"images":11,"macros":1,"external_links":1,"defined_names":13,"comments":0,"pivot_tables":0},"unopened":[],"bounds":{"document_bytes":16777216,"sheet_cells":100000,"rows_first":2000,"rows_last":500,"rows_between":2000,"halvings":0,"cell_chars":16384,"cell_head_chars":4096},"cells_cut":0,"cells_raw":0,"read":"whole","date_system":"1900"}

{"sheet":"Instructions","index":0,"n_rows":278,"n_cols":16,"rows_kept":278,"cut":false,"hidden":false,"merged":[[177,0,177,12],[20,0,20,4],[34,0,34,4],[48,0,48,7],[49,0,49,6],[63,0,63,11],[83,0,83,13],[96,0,96,6],[116,0,116,4],[136,0,136,12],[175,0,175,11],[176,0,176,13],[19,0,19,7],[0,0,0,2],[1,0,1,5],[2,0,2,4],[3,0,3,4],[4,0,4,7]]}
["INSTRUCTIONS"]
["There are pop-up notes to help with many of the cells:  "]
["The TEQ tab is your worksheet to work with."]
["It is unprotected so you can modify it as you like."]
["However, adding or deleting Rows will cause the Macros to not function properly.  "]
[]
[]
[]
[]
[]
[]
[]
[]
[]
[]
[]
[]
[]
[]
["Both worksheets are protected so that you can only put  a \"1\" in Column \"A\"."]
["BIDLIST:   (Sorted numerically by ITEM NO.)"]
[]
[]
[]
[]
[]
[]
[]
[]
[]
[]
[]
[]
[]
["Alphabetical:  (Sorted alphabetically by ITEM.)"]
[]
[]
[]
[]
[]
[]
[]
[]
[]
[]
[]
[]
[]
["Make your selections, then Click the \"Transfer to TEQ\" button."]
["Note that when you put a \"1\" in Column A the Item is highlighted."]
[]
[]
[]
[]
[]
[]
[]
[]
[]
[]
[]
[]
[]
["When you Click the \"Transfer to TEQ\" button, the TEQ worksheet is automatically filled in with your selections."]
[]
[]
[]
[]
[]
[]
[]
[]
[]
[]
[]
[]
[]
[]
[]
[]
[]
[]
[]
["If you discover that you forgot an ITEM NO. you can go back and put a \"1\" in the appropriate Item and reclick the \"Transfer to TEQ\" button. "]
[]
[]
[]
[]
[]
[]
[]
[]
[]
[]
[]
[]
["The added Item(s) are added to the bottom of the TEQ listing."]
[]
[]
[]
[]
[]
[]
[]
[]
[]
[]
[]
[]
[]
[]
[]
[]
[]
[]
[]
["Use the \"Sort Bid Items\" button to resort the list."]
[]
[]
[]
[]
[]
[]
[]
[]
[]
[]
[]
[]
[]
[]
[]
[]
[]
[]
[]
["The ESTIMATED QUANTITIES ROADWAY CODE Column has drop-down lists to select your Improvement Code choices."]
[]
[]
[]
[]
[]
[]
[]
[]
[]
[]
[]
[]
[]
[]
[]
[]
[]
[]
[]
[]
[]
[]
[]
[]
[]
[]
[]
[]
[]
[]
[]
[]
[]
[]
[]
[]
[]
[]
["If you need more Columns Click the \"Insert Additional Code Column\" button. A new Column will be added."]
["The Merged \"TOTAL ESTIMATED QUANTITIES\" AND \"ESTIMATED QUANTITIES\" will automatically adjust for one extra column."]
["For two or more columns added, you will need to manually merge these titles."]
[]
[]
[]
[]
[]
[]
[]
[]
[]
[]
[]
[]
[]
[]
[]
[]
[]
[]
[]
[]
[]
[]
[]
[]
[]
[]
[]
[]
[]
[]
[]
[]
[]
[]
[]
[]
[]
[]
[]
[]
[]
[]
[]
[]
[]
[]
[]
[]
[]
[]
[]
[]
[]
[null,null,null,null,null,null,null,null,null,null,null,null,null,null,null,"Code List"]
[null,null,null,null,null,null,null,null,null,null,null,null,null,null,null,"ROADWAY"]
[null,null,null,null,null,null,null,null,null,null,null,null,null,null,null,"STRUCTURE"]
[]
[null,null,null,null,null,null,null,null,null,null,null,null,null,null,null,"Codes"]
[null,null,null,null,null,null,null,null,null,null,null,null,null,null,null,"CODE 01"]
[null,null,null,null,null,null,null,null,null,null,null,null,null,null,null,"CODE 03"]
[null,null,null,null,null,null,null,null,null,null,null,null,null,null,null,"CODE 04"]
[null,null,null,null,null,null,null,null,null,null,null,null,null,null,null,"CODE 05"]
[null,null,null,null,null,null,null,null,null,null,null,null,null,null,null,"CODE 06"]
[null,null,null,null,null,null,null,null,null,null,null,null,null,null,null,"CODE 07"]
[null,null,null,null,null,null,null,null,null,null,null,null,null,null,null,"CODE 08"]
[null,null,null,null,null,null,null,null,null,null,null,null,null,null,null,"CODE 10"]
[null,null,null,null,null,null,null,null,null,null,null,null,null,null,null,"CODE 11"]
[null,null,null,null,null,null,null,null,null,null,null,null,null,null,null,"CODE 13"]
[null,null,null,null,null,null,null,null,null,null,null,null,null,null,null,"CODE 14"]
[null,null,null,null,null,null,null,null,null,null,null,null,null,null,null,"CODE 15"]
[null,null,null,null,null,null,null,null,null,null,null,null,null,null,null,"CODE 16"]
[null,null,null,null,null,null,null,null,null,null,null,null,null,null,null,"CODE 17"]
[null,null,null,null,null,null,null,null,null,null,null,null,null,null,null,"CODE 18"]
[null,null,null,null,null,null,null,null,null,null,null,null,null,null,null,"CODE 19"]
[null,null,null,null,null,null,null,null,null,null,null,null,null,null,null,"CODE 20"]
[null,null,null,null,null,null,null,null,null,null,null,null,null,null,null,"CODE 21"]
[null,null,null,null,null,null,null,null,null,null,null,null,null,null,null,"CODE 22"]
[null,null,null,null,null,null,null,null,null,null,null,null,null,null,null,"CODE 23"]
[null,null,null,null,null,null,null,null,null,null,null,null,null,null,null,"CODE 24"]
[null,null,null,null,null,null,null,null,null,null,null,null,null,null,null,"CODE 25"]
[null,null,null,null,null,null,null,null,null,null,null,null,null,null,null,"CODE 26"]
[null,null,null,null,null,null,null,null,null,null,null,null,null,null,null,"CODE 27"]
[null,null,null,null,null,null,null,null,null,null,null,null,null,null,null,"CODE 28"]
[null,null,null,null,null,null,null,null,null,null,null,null,null,null,null,"CODE 29"]
[null,null,null,null,null,null,null,null,null,null,null,null,null,null,null,"CODE 30"]
[null,null,null,null,null,null,null,null,null,null,null,null,null,null,null,"CODE 31"]
[null,null,null,null,null,null,null,null,null,null,null,null,null,null,null,"CODE 32"]
[null,null,null,null,null,null,null,null,null,null,null,null,null,null,null,"CODE 33"]
[null,null,null,null,null,null,null,null,null,null,null,null,null,null,null,"CODE 34"]
[null,null,null,null,null,null,null,null,null,null,null,null,null,null,null,"CODE 35"]
[null,null,null,null,null,null,null,null,null,null,null,null,null,null,null,"CODE 36"]
[null,null,null,null,null,null,null,null,null,null,null,null,null,null,null,"CODE 37"]
[null,null,null,null,null,null,null,null,null,null,null,null,null,null,null,"CODE 38"]
[null,null,null,null,null,null,null,null,null,null,null,null,null,null,null,"CODE 39"]
[null,null,null,null,null,null,null,null,null,null,null,null,null,null,null,"CODE 40"]
[null,null,null,null,null,null,null,null,null,null,null,null,null,null,null,"CODE 41"]
[null,null,null,null,null,null,null,null,null,null,null,null,null,null,null,"CODE 42"]
[null,null,null,null,null,null,null,null,null,null,null,null,null,null,null,"CODE 43"]
[null,null,null,null,null,null,null,null,null,null,null,null,null,null,null,"CODE 44"]
[null,null,null,null,null,null,null,null,null,null,null,null,null,null,null,"CODE 45"]

{"sheet":"TEQ","index":1,"n_rows":6,"n_cols":5,"rows_kept":6,"cut":false,"hidden":false,"merged":[[1,0,1,4],[2,0,5,0],[2,1,5,1],[2,2,5,2],[2,3,2,4],[3,4,5,4]]}
[null,"ADDING OR DELETING ROWS WILL\n ADVERSELY AFFECT MACRO PERFORMANCE"]
["TOTAL ESTIMATED QUANTITIES"]
["ITEM NO.","ITEM","UNIT","ESTIMATED QUANTITIES"]
[null,null,null,"ROADWAY","TOTAL"]
[]
[null,null,null,"CODE 01"]

{"sheet":"BIDLIST","index":2,"n_rows":1988,"n_cols":6,"rows_kept":1988,"cut":false,"hidden":false,"merged":[]}
["ators","S","ITEM NO.","ITEM","UNIT"]
[null,"S",105.09,"CONTRACTOR SURVEYING","MI",{"$f":"IF(ISBLANK(B2),\"\",B2)","v":"S"}]
[null,null,105.09010000000001,"CONTRACTOR SURVEYING","LS",""]
[null,null,106.051,"FIELD LABORATORY ","EA",""]
[null,null,106.05200000000001,"CONTRACTOR TESTING","LS",""]
[null,"S",107.07,"RAILROAD INSURANCE","LS","S"]
[null,null,108.03,"CPM SCHEDULE","LS",""]
[null,null,109.04,"FORCE ACCOUNT WORK","$$",""]
[null,null,109.08,"MOBILIZATION","LS",""]
[null,"S",109.09,"DYNAMIC COMPACTION MOBILIZATION","LS","S"]
[null,"S",199,"CONTROLS FOR LEAD PAINT REMOVAL","LS","S"]
[null,"S",199.00004999999999,"ADJUSTING UTILITIES","$$","S"]
[null,"S",199.0001,"TRIBAL EMPLOYMENT RIGHTS ORDINANCE","LS","S"]
[null,null,201.03200000000001,"CLEARING AND GRUBBING","LS",""]
[null,null,201.03201000000001,"CLEARING AND GRUBBING","ACRE",""]
[null,null,201.03206,"CLEARING TREES 6 in ","EA",""]
[null,null,201.03208000000001,"CLEARING TREES 8 in ","EA",""]
[null,null,201.03210000000001,"CLEARING TREES 10 in ","EA",""]
[null,null,201.03218000000001,"CLEARING TREES 18 in ","EA",""]
[null,null,201.03224,"CLEARING TREES 24 in ","EA",""]
[null,null,201.03229999999999,"CLEARING TREES 30 in ","EA",""]
[null,null,201.03247999999999,"CLEARING TREES 48 in","EA",""]
[null,null,201.0326,"CLEARING TREES 60 in","EA",""]
[null,null,202.03100000000001,"REMOVAL OF STRUCTURES AND OBSTRUCTIONS","LS",""]
[null,null,202.03120000000001,"REMOVAL OF SIGNS","LS",""]
[null,null,202.03129999999999,"REMOVAL OF SIGN STRUCTURES","LS",""]
[null,null,202.03139999999999,"REMOVAL OF CATTLE GUARDS","EA",""]
[null,null,202.03149999999999,"REMOVAL OF SNOW FENCE","FT",""]
[null,null,202.03155000000001,"REMOVAL OF SNOW FENCE PANELS","EA",""]
[null,null,202.03165000000001,"REMOVAL OF GUARDRAIL AND BARRIER (DO NOT USE)","FT",""]
[null,null,202.0317,"REMOVAL OF GUARDRAIL","FT",""]
[null,null,202.03174999999999,"REMOVAL OF CONCRETE BARRIER","FT",""]
[null,null,202.03205,"REMOVAL OF FENCE","FT",""]
[null,null,202.03210000000001,"REMOVAL OF STEEL BRIDGES","EA",""]
[null,null,202.03219999999999,"REMOVAL OF TIMBER BRIDGES","EA",""]
[null,null,202.03229999999999,"REMOVAL OF CONCRETE BRIDGES","EA",""]
[null,null,202.0325,"REMOVAL OF RC BOX CULVERTS","LS",""]
[null,null,202.03251,"REMOVAL OF BRIDGE RAIL","FT",""]
[null,null,202.03252000000001,"REMOVAL OF PEDESTRIAN RAIL","FT",""]
[null,null,202.0326,"REMOVAL OF PIPE ","FT",""]
[null,null,202.03270000000001,"REMOVAL OF PIPE ","EA",""]
[null,null,202.03280000000001,"REMOVAL OF PIPE FE SECTION","EA",""]
[null,null,202.03290000000001,"REMOVAL OF MANHOLES","EA",""]
[null,null,202.03295,"REMOVAL OF INLETS","EA",""]
[null,null,202.03299999999999,"REMOVAL OF STORM SEWER","FT",""]
[null,null,202.03300999999999,"REMOVAL OF STORM SEWER","LS",""]
[null,null,202.03305,"MILLING PLANT MIX","SY",""]
[null,null,202.03309999999999,"MILLING PLANT MIX","CY",""]
[null,null,202.03315000000001,"MILLING PLANT MIX","TON",""]
[null,null,202.03317000000001,"MILLING CONCRETE ","SY",""]
[null,null,202.03317999999999,"MILLING CONCRETE ","CY",""]
[null,null,202.03319999999999,"PROFILE MILLING PLANT MIX","SY",""]
[null,null,202.03325000000001,"PROFILE MILLING PLANT MIX","TON",""]
[null,null,202.0333,"PROFILE MILLING PLANT MIX","CY",""]
[null,null,202.03399999999999,"REMOVAL OF SURFACING","SY",""]
[null,null,202.03405000000001,"REMOVAL OF SURFACING","CY",""]
[null,null,202.0341,"REMOVAL OF SURFACING","TON",""]
[null,null,202.03415000000001,"REMOVAL OF CONCRETE PAVEMENT","SY",""]
[null,null,202.03416000000001,"REMOVAL OF CONCRETE PAVEMENT","CY",""]
[null,null,202.03416999999999,"REMOVAL OF CONCRETE PAVEMENT","LS",""]
[null,"S",202.03417999999999,"REMOVAL OF METAL BACKER ROD","FT","S"]
[null,null,202.0342,"REMOVAL OF CRUSHED BASE","TON",""]
[null,null,202.03422,"REMOVAL OF CRUSHED BASE","CY",""]
[null,null,202.03424999999999,"REMOVAL OF CRUSHED BASE","SY",""]
[null,null,202.0343,"REMOVAL OF SIDEWALK","SY",""]
[null,null,202.03431,"REMOVAL OF SIDEWALK","FT",{"$f":"IF(ISBLANK(B66),\"\",B66)","v":""}]
[null,null,202.03434999999999,"REMOVAL OF BIT CURB","FT",""]
[null,null,202.03440000000001,"REMOVAL OF CURB","FT",""]
[null,null,202.03444999999999,"REMOVAL OF CURB AND GUTTER","FT",""]
[null,null,202.03450000000001,"REMOVAL OF DOUBLE GUTTER","FT",""]
[null,null,202.03455,"REMOVAL OF DOUBLE GUTTER","SY",""]
[null,null,202.03460000000001,"REMOVAL OF CONCRETE","LS",""]
[null,null,202.03465,"REMOVAL OF CONCRETE","CY",""]
[null,null,202.03469999999999,"REMOVAL OF CONCRETE","SY",""]
[null,null,202.03475,"REMOVAL OF CONCRETE MEDIAN","SY",""]
[null,null,202.03476000000001,"REMOVAL OF CONCRETE MEDIAN","LS",""]
[null,null,202.03477000000001,"REMOVAL OF CONCRETE MEDIAN","CY",""]
[null,null,202.035,"RESET MAILBOX (SINGLE)","EA",""]
[null,null,202.0351,"RESET MAILBOX (DOUBLE)","EA",""]
[null,null,202.0352,"RESET MAILBOX (MULTIPLE)","EA",""]
[null,null,202.03530000000001,"RESET MAILBOX (CANTILEVER)","EA",""]
[null,null,202.036,"CUTTING BIT PVMT","FT",""]
[null,null,202.0361,"CUTTING CONCRETE","FT",""]
[null,null,203.02,"BORROW SPECIAL EXCAVATION","CY",""]
[null,null,203.02109999999999,"BORROW SPECIAL EXCAVATION","TON",""]
[null,null,203.02199999999999,"ROCK EXCAVATION","CY",""]
[null,null,203.024,"MUCK EXCAVATION","CY",""]
[null,null,203.02500000000001,"UNCLASSIFIED EXCAVATION","CY",""]
[null,null,204.03100000000001,"HAUL ","CYMI",""]
[null,null,204.03200000000001,"HAUL ","TMI",""]
[null,null,205.03100000000001,"HAUL ROAD MAINTENANCE/RESTORATION","$$",""]
[null,null,206.03100000000001,"FLOWABLE BACKFILL","CY",""]
[null,null,206.03200000000001,"TRENCH SUBEXCAVATION","CY",""]
[null,null,206.03299999999999,"CULVERT SUBEXCAVATION","CY",""]
[null,null,207.03100000000001,"TOPSOIL STORING","CY",""]
[null,null,207.03200000000001,"TOPSOIL PLACING","CY",""]
[null,null,207.03299999999999,"TOPSOIL BORROW","CY",""]
[null,null,209.01,"WATER","MG",""]
[null,null,210.03200000000001,"BULLDOZER","HR",""]
[null,null,210.03299999999999,"MOTOR GRADER","HR",""]
[null,null,210.0341,"ROLLER, TYPE I","HR",""]
[null,null,210.0342,"ROLLER, TYPE II","HR",""]
[null,null,210.0343,"ROLLER, TYPE III","HR",""]
[null,null,210.03440000000001,"ROLLER, TYPE IV","HR",""]
[null,null,210.03450000000001,"ROLLER, TYPE V","HR",""]
[null,null,210.03460000000001,"ROLLER, TYPE VI","HR",""]
[null,null,210.03469999999999,"ROLLER, TYPE VII","HR",""]
[null,null,210.035,"SCRAPER","CYHR",""]
[null,null,210.036,"TRUCK","CYHR",""]
[null,null,210.0361,"EXCAVATOR","HR",""]
[null,null,210.03700000000001,"LOADER","HR",""]
[null,null,210.03710000000001,"BACKHOE","HR",""]
[null,null,211.03315000000001,"CULVERT CLEANING","EA",""]
[null,null,212.02099999999999,"DRY EXCAVATION","CY",""]
[null,null,212.02199999999999,"WET EXCAVATION","CY",""]
[null,null,212.03899999999999,"PERVIOUS BACKFILL MATERIAL","CY",""]
[null,null,212.03909999999999,"PERVIOUS BACKFILL MATERIAL","TON",""]
[null,"S",212.03915000000001,"STRUCTURAL BACKFILL MATERIAL","CY","S"]
[null,"S",212.03919999999999,"STRUCTURE EXCAVATION","CY","S"]
[null,"S",212.03925000000001,"FLEXIBLE COFFERDAM SYSTEM","FT","S"]
[null,null,213.03100000000001,"OVERBURDEN REMOVAL","CY",""]
[null,null,213.03110000000001,"OVERBURDEN PLACING","CY",""]
[null,null,214.01,"HYDRATED LIME ( SUBGRADE)","TON",""]
[null,null,214.01009999999999,"PROCESSING (LIME TREATED SUBGRADE)","FT",""]
[null,null,214.0102,"PROCESSING (LIME TREATED SUBGRADE) ","STA",""]
[null,null,214.0103,"PROCESSING (LIME TREATED SUBGRADE)","SY",""]
[null,null,215.01,"CONTRACTOR STORM WATER CONTROL","LS",""]
[null,null,215.01009999999999,"DEPARTMENT STORM WATER CONTROL","$$",""]
[null,null,215.03200000000001,"BURLAP BAG CURB","FT",""]
[null,null,215.03299999999999,"SILT FENCE","FT",{"$f":"IF(ISBLANK(B130),\"\",B130)","v":""}]
[null,null,215.03309999999999,"TRIANGULAR SILT DIKE","FT",""]
[null,null,215.03399999999999,"EROSION BALES","EA",""]
[null,null,215.03402,"EXCELSIOR SEDIMENT LOG","FT",""]
[null,null,215.03404,"ROCK CHECK DIKES","FT",""]
[null,null,215.0341,"EROSION CONTROL AGENT","ACRE",""]
[null,null,215.03415000000001,"EROSION CONTROL AGENT","TON",""]
[null,null,216.03100000000001,"SEEDING (PLS)","LB",""]
[null,null,216.03104999999999,"SEEDING ","SY",""]
[null,null,216.03107,"SEEDING ","LS",""]
[null,null,216.03110000000001,"SEEDING SPECIAL (PLS)","LB",""]
[null,null,216.03120000000001,"FERTILIZER TYPE I ","LB",""]
[null,null,216.03129999999999,"FERTILIZER TYPE II ","LB",""]
[null,null,216.03135,"FERTILIZER TYPE III","LB",""]
[null,null,216.03139999999999,"FERTILIZER TYPE IV ","LB",""]
[null,null,216.03149999999999,"FERTILIZER TYPE V ","TON",""]
[null,null,216.03151,"FERTILIZER TYPE V","CY",""]
[null,null,216.0316,"FERTILIZER TYPE VI ","LB",""]
[null,null,216.0317,"FERTILIZER TYPE VII ","LB",""]
[null,"S",216.0318,"FERTILIZER SPECIAL","LB","S"]
[null,null,216.035,"HYDRAULIC SEEDING","TON",""]
[null,null,216.036,"HYDRAULIC MULCHING","TON",""]
[null,null,216.03700000000001,"SODDING","SY",""]
[null,null,216.03899999999999,"DRY MULCH","TON",""]
[null,null,216.03909999999999,"EROSION CONTROL BLANKET","SY",""]
[null,null,216.03919999999999,"EROSION CONTROL NETTING","SY",""]
[null,null,216.0394,"MULCH TACK TYPE AR","ACRE",""]
[null,null,216.0395,"MULCH TACK TYPE MC","ACRE",""]
[null,null,216.03952000000001,"MULCH TACK TYPE GU","ACRE",""]
[null,null,216.03954999999999,"COCONUT FIBER DITCH LINING","SY",""]
[null,"S",216.03955999999999,"BENTONITE DITCH LINING","SY","S"]
[null,"S",216.03960000000001,"SYNTHETIC MATTING","SY","S"]
[null,"S",216.03970000000001,"LANDSCAPING WORK","LS","S"]
[null,"S",216.03971999999999,"WETLAND CONSTRUCTION ","$$","S"]
[null,"S",216.03972999999999,"WETLAND CONSTRUCTION ","LS","S"]
[null,"S",216.07499999999999,"TREE GRATES","EA","S"]
[null,"S",216.07599999999999,"PAVERS","SF","S"]
[null,null,217.01,"GEOTEXTILE, DRAINAGE AND FILTRATION","SY",""]
[null,null,217.01009999999999,"GEOTEXTILE, EROSION CONTROL","SY",""]
[null,null,217.0102,"GEOTEXTILE, MATERIAL SEPARATION (WOVEN)","SY",""]
[null,null,217.01025000000001,"GEOTEXTILE, MATERIAL SEPARATION (NON-WOVEN)","SY",""]
[null,null,217.0103,"GEOTEXTILE, EMB AND RETAINING WALL","SY",""]
[null,null,217.0104,"GEOTEXTILE, SILT FENCE","SY",""]
[null," ",217.01043000000001,"GEOTEXTILE, SUBGRADE REINFORCEMENT","SY"," "]
[null,"S",217.01044999999999,"GEOGRID","SY","S"]
[null,"S",217.01050000000001,"GEOCELL","SY","S"]
[null,"S",217.01054999999999,"UNIAXIAL GEOGRID TYPE I","SY","S"]
[null,"S",217.01060000000001,"UNIAXIAL GEOGRID TYPE II","SY","S"]
[null,"S",217.01065,"BIAXIAL GEOGRID","SY","S"]
[null,"S",217.01069000000001,"BIAXIAL GEOGRID (STIFF)","SY","S"]
[null,"S",217.01075,"HIGH DENSITY STRESS RELIEF INTERLAYER","FT","S"]
[null,"S",217.01079999999999,"HIGH DENSITY POLYURETHANE FILL","LB","S"]
[null,"S",217.01085,"SOIL REINFORCING MATTING","SY","S"]
[null,null,218.01,"IMPERMEABLE PLASTIC MEMBRANE","SY",""]
[null,null,219.01,"ROCKFALL MESH","SY",""]
[null,null,219.02500000000001,"DRIVEN ANCHORS","EA",""]
[null,null,219.03,"GROUTED ANCHORS","EA",""]
[null,"S",219.035,"SOIL ANCHORS","EA","S"]
[null,"S",219.04,"ROCK BOLTS","EA","S"]
[null,"S",219.04499999999999,"FRICTION ROCK BOLTS","EA","S"]
[null,"S",219.05,"ROCK BOLTS (ENCAPSULATED)","EA","S"]
[null,"S",219.05009999999999,"ROCK BOLTS (ENCAPSULATED)","FT","S"]
[null,"S",219.05500000000001,"ROCK BOLTS (POINT ANCHORED)","EA","S"]
[null,"S",219.06,"ROCK RETENTION SYSTEM","LS","S"]
[null,null,220.01,"SCALING (MACHINE)","HR",{"$f":"IF(ISBLANK(B194),\"\",B194)","v":""}]
[null,null,220.01009999999999,"SCALING (MANUAL)","CRWH",""]
[null,null,221.01,"DUST CONTROL AGENT","TON",""]
[null,"S",299.01400000000001,"PANEL ERECTION (STEEL)","SF","S"]
[null,"S",299.01499999999999,"REINFORCED EARTH BACKFILL MATERIAL","CY","S"]
[null,"S",299.017,"MECHANICALLY STABILIZED EARTHWALL","SF","S"]
[null,"S",299.01799999999997,"PNEUMATICALLY APPLIED MORTAR","SY","S"]
[null,"S",299.01900000000001,"DYNAMIC COMPACTION DROP","EA","S"]
[null,"S",299.02,"BLAST HOLE","FT","S"]
[null,"S",299.02005000000003,"CONTROLLED BLASTING","LS","S"]
[null,"S",299.02100000000002,"CONTROLLED BLASTING","FT","S"]
[null,"S",299.02199999999999,"CONTROLLED BLASTING TEST SHOTS","FT","S"]
[null,"S",299.02210000000002,"BREAKING BOULDERS","FT","S"]
[null,"S",299.02300000000002,"PRESPLITTING","FT","S"]
[null,"S",299.024,"CUSHION BLASTING","FT","S"]
[null,"S",299.03500000000003,"INSTALLING SETTLEMENT PLATFORM ","EA","S"]
[null,"S",299.036,"CONTAMINATED EXCAVATION","CY","S"]
[null,"S",299.03699999999998,"WOOD CHIPS","CY","S"]
[null,"S",299.03800000000001,"REMOVE AND RESET HISTORICAL MARKER","LS","S"]
[null,"S",299.03899999999999,"GEOTEXTILE BAG CURB","FT","S"]
[null,"S",299.03910000000002,"REMOVE AND REPLACE TOPSOIL","MI","S"]
[null,null,301.01,"PIT RUN SUBBASE","TON",""]
[null,null,301.01010000000002,"PIT RUN SUBBASE","CY",""]
[null,null,301.01015000000001,"PIT RUN SUBBASE","SY",""]
[null,null,301.0102,"CRUSHER RUN SUBBASE","TON",""]
[null,null,301.01029999999997,"CRUSHER RUN SUBBASE","CY",""]
[null,null,301.01035000000002,"CRUSHER RUN SUBBASE","SY",""]
[null,null,301.0104,"CRUSHED SUBBASE","TON",""]
[null,null,301.01044999999999,"CRUSHED SUBBASE","CY",""]
[null,null,301.01047,"CRUSHED SUBBASE","SY",""]
[null,null,301.01049999999998,"SUBBASE","TON",""]
[null,null,301.01055000000002,"SUBBASE","CY",""]
[null,null,301.01056999999997,"SUBBASE","SY",""]
[null,null,301.01060000000001,"BED COURSE MATERIAL","TON",""]
[null,null,301.01065,"BED COURSE MATERIAL","CY",""]
[null,null,301.01065999999997,"BED COURSE MATERIAL","SY",""]
[null,null,301.01076,"CRUSHED BASE","SY",""]
[null,null,301.01080000000002,"CRUSHED BASE","TON",""]
[null,null,301.01085,"CRUSHED BASE","CY",""]
[null,"S",301.01085999999998,"RECYCLED CRUSHED BASE","CY","S"]
[null,"S",301.01087000000001,"RECYCLED CRUSHED BASE","TON","S"]
[null,"S",301.01094000000001,"REUSED BASE","CY","S"]
[null,"S",301.01096000000001,"REUSED BASE","TON","S"]
[null,null,302,"BLENDED BASE","TON ",""]
[null,null,302.00009999999997,"BLENDED SUBBASE","TON ",""]
[null,null,302.00020000000001,"BLENDED BASE","CY",""]
[null,null,302.00029999999998,"BLENDED SUBBASE","CY",""]
[null,"S",305.01,"CEMENT TREATED BASE","TON","S"]
[null,"S",305.01004999999998,"CEMENT TREATED BASE","CY","S"]
[null,"S",305.01010000000002,"PORTLAND CEMENT (CEMENT TREATED BASE)","TON","S"]
[null,"S",305.0102,"FLY ASH (CEMENT TREATED BASE)","TON","S"]
[null,"S",309.01,"EMULSION STABILIZED BASE","TON","S"]
[null,null,310.01,"STOCKPILED CRUSHER RUN SUBBASE","TON",""]
[null,null,310.01002,"STOCKPILED CRUSHER RUN SUBBASE","CY",""]
[null,null,310.01004999999998,"STOCKPILED PIT RUN AGGREGATE","TON",""]
[null,null,310.01006999999998,"STOCKPILED PIT RUN AGGREGATE","CY",""]
[null,null,310.01010000000002,"STOCKPILED SCREENED AGGREGATE","TON",""]
[null,null,310.01011,"STOCKPILED SCREENED AGGREGATE (SALT MIXED)","TON",""]
[null,null,310.01011999999997,"STOCKPILED SCREENED AGGREGATE","CY",""]
[null,null,310.01013,"STOCKPILED SCREENED AGGREGATE (SALT MIXED)","CY",""]
[null,null,310.01015000000001,"STOCKPILED PIT RUN FILLER MATERIAL","TON",""]
[null,null,310.01017000000002,"STOCKPILED PIT RUN FILLER MATERIAL","CY",""]
[null,null,310.0102,"STOCKPILED AGGREGATE","TON",""]
[null,null,310.01020999999997,"STOCKPILED AGGREGATE","CY",""]
[null,null,310.01029999999997,"STOCKPILED CRUSHED BASE","TON",{"$f":"IF(ISBLANK(B258),\"\",B258)","v":""}]
[null,null,310.01031999999998,"STOCKPILED CRUSHED BASE","CY",""]
[null,null,310.01035000000002,"STOCKPILED CHIP SEAL AGGREGATE","TON",""]
[null,null,310.0104,"STOCKPILED CHIP SEAL AGGREGATE","CY",""]
[null,null,310.02,"MAINT STOCKPILE TYPE A 3/8 in ","TON",""]
[null,null,310.02005000000003,"MAINT STOCKPILE TYPE A 3/8 in ","CY",""]
[null,null,310.02010000000001,"MAINT STOCKPILE TYPE A 1/2 in ","TON",""]
[null,null,310.02015,"MAINT STOCKPILE TYPE A 1/2 in ","CY",""]
[null,null,310.02019999999999,"MAINT STOCKPILE TYPE B 3/8 in ","TON",""]
[null,null,310.02024999999998,"MAINT STOCKPILE TYPE B 3/8 in ","CY",""]
[null,null,310.02030000000002,"MAINT STOCKPILE TYPE B 3/8 in  (SALT MIXED)","TON",""]
[null,null,310.02035000000001,"MAINT STOCKPILE TYPE B 3/8 in  (SALT MIXED)","CY",""]
[null,null,310.0204,"MAINT STOCKPILE TYPE B 1/2 in ","TON",""]
[null,null,310.02042,"MAINT STOCKPILE TYPE B 1/2 in (SALT MIXED)","TON",""]
[null,null,310.02044999999998,"MAINT STOCKPILE TYPE B 1/2 in ","CY",""]
[null,null,310.02046999999999,"MAINT STOCKPILE TYPE B 1/2 in (SALT MIXED)","CY",""]
[null,null,310.02050000000003,"MAINT STOCKPILE TYPE B 3/4 in ","TON",""]
[null,null,310.02051,"MAINT STOCKPILE TYPE B 3/4 in (SALT MIXED)","TON",""]
[null,null,310.02051999999998,"MAINT STOCKPILE TYPE B 3/4 in ","CY",""]
[null,null,310.02053999999998,"MAINT STOCKPILE TYPE B 3/4 in (SALT MIXED)","CY",""]
[null,null,310.02055000000001,"MAINT STOCKPILE TYPE B NO. 4 ","TON",""]
[null,null,310.02055999999999,"MAINT STOCKPILE TYPE B NO. 4 (SALT MIXED)","TON",""]
[null,null,310.02057000000002,"MAINT STOCKPILE TYPE B NO. 4 ","CY",""]
[null,null,310.02058,"MAINT STOCKPILE TYPE B NO. 4 (SALT MIXED)","CY",""]
[null,null,310.0206,"MAINT STOCKPILE TYPE B NO. 4 MOD ","TON",""]
[null,null,310.02062999999998,"MAINT STOCKPILE TYPE B NO. 4 MOD (SALT MIXED)","TON",""]
[null,null,310.02064999999999,"MAINT STOCKPILE TYPE B NO. 4 MOD ","CY",""]
[null,null,310.02069999999998,"MAINT STOCKPILE TYPE B NO. 4 MOD (SALT MIXED)","CY",""]
[null,null,310.02999999999997,"MAINT STOCKPILE TYPE C","TON",""]
[null,null,310.03005000000002,"MAINT STOCKPILE TYPE C","CY",""]
[null,null,310.0301,"MAINT STOCKPILE TYPE C (SALT MIXED)","TON",""]
[null,null,310.03014999999999,"MAINT STOCKPILE TYPE C (SALT MIXED)","CY",""]
[null,"S",310.03095000000002,"MAINT STOCKPILE (PLANT MIXED)","TON","S"]
[null,"S",310.03097000000002,"MAINT STOCKPILE (PLANT MIXED)","CY","S"]
[null,null,310.03800000000001,"SODIUM CHLORIDE ","TON",""]
[null,"S",311.01010000000002,"GRAVEL FOR ARRESTOR BED","CY","S"]
[null,"S",399,"RUBBLIZING PAVEMENT","SY","S"]
[null,"S",399.00004999999999,"PLACING STOCKPILED MATERIAL","TON","S"]
[null,"S",399.00009999999997,"PLACING STOCKPILED MATERIAL","CY","S"]
[null,"S",399.00015000000002,"PLANT MIX BIT BASE","TON","S"]
[null,"S",399.00020000000001,"RECYCLED PLANT MIX BIT BASE","TON","S"]
[null,"S",399.00020999999998,"FULL DEPTH RECLAMATION","SY","S"]
[null,"S",399.00022000000001,"STABILIZED FULL DEPTH RECLAMATION","SY","S"]
[null,"S",399.00022999999999,"CEMENT STABILIZED FULL DEPTH RECLAMATION","SY","S"]
[null,"S",399.00024000000002,"EMULSION STABILIZED FULL DEPTH RECLAMATION","SY","S"]
[null,"S",399.00024999999999,"ASPHALT TREATED PERMEABLE BASE","TON","S"]
[null,"S",399.00026000000003,"FULL DEPTH RECLAMATION","CY","S"]
[null,"S",399.00027,"STREAM BED MATERIAL","CY","S"]
[null,"S",399.00031999999999,"STOCKPILED RECLAIMED ASPHALT PAVEMENT","CY","S"]
[null,"S",399.00038999999998,"ASPHALT STABILIZED FULL DEPTH RECLAMATION","SY","S"]
[null,"S",399.00040000000001,"EMULSION STABILIZED BLENDED BASE","TON","S"]
[null,null,401.02,"HOT PLANT MIX ","TON",""]
[null,"S",401.02005000000003,"PLANT MIX PAVEMENT RCI","TON","S"]
[null,"S",401.02010000000001,"WARM PLANT MIX","TON","S"]
[null,"S",401.02015,"WARM PLANT MIX (RECYCLE)","TON","S"]
[null,"S",401.02019999999999,"PLANT MIX  ","TON","S"]
[null,null,401.02021000000002,"HOT PLANT MIX (SUPERPAVE)                                      (DO NOT USE) ","TON",""]
[null,null,401.02026000000001,"HOT PLANT MIX LEVELING (SUPERPAVE)                  (DO NOT USE)","TON",""]
[null,"S",401.02026999999998,"PLANT MIX LEVELING","TON","S"]
[null,null,401.02030000000002,"HOT PLANT MIX LEVELING","TON",""]
[null,"S",401.02030999999999,"WARM PLANT MIX LEVELING","TON","S"]
[null,null,401.0204,"TEST STRIP","EA",""]
[null,null,401.02055000000001,"HOT PLANT MIX  APPROACHES","TON",""]
[null,"S",401.02055999999999,"WARM PLANT MIX APPROACHES","TON","S"]
[null,"S",401.0206,"PLANT MIX  APPROACHES ","TON",{"$f":"IF(ISBLANK(B322),\"\",B322)","v":"S"}]
[null,"S",401.0213,"HOT PLANT MIX  MAINT","TON","S"]
[null,"S",401.02135000000004,"HOT PLANT MIX  MAINT","SY","S"]
[null,null,401.03309999999999,"HOT PLANT MIX (RECYCLE)","TON",""]
[null,null,401.03314999999998,"HOT PLANT MIX LEVELING (RECYCLE)","TON",""]
[null,null,401.03320000000002,"HOT PLANT MIX APPROACHES (RECYCLE) ","TON",""]
[null,null,401.03321,"ASPHALT BINDER (PG 58-28)","TON",""]
[null,null,401.03321999999997,"ASPHALT BINDER (PG 64-28)","TON",""]
[null,null,401.03323,"ASPHALT BINDER (PG 64-22)","TON",""]
[null,null,401.03323999999998,"ASPHALT BINDER (PG 70-22)","TON",""]
[null,null,401.03325000000001,"ASPHALT BINDER (PG 70-28)","TON",""]
[null,null,401.03325999999998,"ASPHALT BINDER (PG 64-34)","TON",""]
[null,null,401.03327000000002,"ASPHALT BINDER (PG 58-34)","TON",""]
[null,null,401.03327999999999,"ASPHALT BINDER (PG 70-34)","TON",""]
[null,null,401.03329000000002,"ASPHALT BINDER (PG 76-28)","TON",""]
[null,"S",401.0333,"ASPHALT BINDER (PG 70E-28)","TON","S"]
[null,"S",403.05,"ARAMID FIBERS","LB","S"]
[null,null,403.0505,"CRACK SEAL (PLANT MIX)","LB",""]
[null,null,403.05054999999999,"CRACK SEAL (PLANT MIX)","CF",""]
[null,"S",403.05059999999997,"CRACK SURFACING (PLANT MIX)","CF","S"]
[null,null,404.01,"PLANT MIX WEARING COURSE","TON",""]
[null,"S",404.01001000000002,"HIGH PERFORMANCE WEARING COURSE","TON","S"]
[null,"S",404.01002,"WARM PLANT MIX WEARING COURSE","TON","S"]
[null,null,404.01004999999998,"SEAL COAT","TON",""]
[null,null,406.03005000000002,"PLANT MIX (COMMERCIAL)","TON",""]
[null,null,407.01,"TACK COAT","TON",""]
[null,null,408.01,"PRIME COAT","TON",""]
[null,"S",408.0111,"LIQUID ASPHALT (MAINT)","TON","S"]
[null,null,408.012,"BLOTTER","TON",""]
[null,null,409.02100000000002,"FOG SEAL","TON",""]
[null,null,409.03070000000002,"CHIP SEAL","SY",""]
[null,null,409.03075000000001,"CHIP SEAL (OVERSHOOT)","SY",""]
[null,"S",409.03077999999999,"PLACING STOCKPILED CHIP SEAL AGGREGATE","SY","S"]
[null,"S",409.0308,"EMULSIFIED ASPHALT","TON","S"]
[null,"S",409.03084999999999,"EMULSIFIED ASPHALT MODIFIED","TON","S"]
[null,"S",409.03089999999997,"EMULSIFIED ASPHALT OVERSHOOT","TON","S"]
[null,null,410.01,"MICROSURFACING (AGGREGATE)","TON",""]
[null,null,410.01004999999998,"MICROSURFACING (EMULSIFIED ASPHALT)","TON",""]
[null,null,411.01,"PAVING FABRIC","SY",""]
[null,null,411.01010000000002,"GLASS FIBER REINFORCED PAVING FABRIC","SY",""]
[null,"S",411.01015000000001,"FIBERGLASS-POLYESTER PAVING FABRIC","SY","S"]
[null,"S",411.01015999999998,"POLY-FIBER MATRIX PAVING FABRIC","SY","S"]
[null,"S",411.0102,"SELF-ADHERING WATERPROOFING MEMBRANE","FT","S"]
[null,"S",411.01024999999998,"ASPHALT REINFORCEMENT GRID","SY","S"]
[null,null,412.01,"CURB (PLANT MIX)","FT",""]
[null,null,412.01029999999997,"SPILLWAY (PLANT MIX)","FT",""]
[null,null,412.0104,"BIKE PATH (PLANT MIX)","TON",""]
[null,null,412.01049999999998,"BIKE PATH (PLANT MIX)","SY",""]
[null,null,412.01060000000001,"SIDEWALK (PLANT MIX)","SY",""]
[null,null,412.01069999999999,"MEDIAN PAVING (PLANT MIX)","SY",""]
[null,null,413.01,"HYDRATED LIME","TON",""]
[null,null,414.01,"CONCRETE PVMT","SY",""]
[null,"S",414.01010000000002,"CONCRETE PVMT","CY","S"]
[null,"S",414.01011,"CONCRETE PVMT (HIGH EARLY 8 in) ","SY","S"]
[null,"S",414.0102,"CONCRETE PVMT (HIGH EARLY)","SY","S"]
[null,"S",414.01020999999997,"CONCRETE PVMT (HIGH EARLY 9 in) ","SY","S"]
[null,"S",414.01022,"CONCRETE PVMT (HIGH EARLY 10 in) ","SY","S"]
[null,"S",414.01029999999997,"PORTLAND CEMENT (CONC PVMT)","TON","S"]
[null,null,414.01031,"CONCRETE PVMT (6 in) ","SY",""]
[null,null,414.01035000000002,"CONCRETE PVMT (8 in) ","SY",""]
[null,null,414.0104,"CONCRETE PVMT (9 in) ","SY",""]
[null,null,414.01049999999998,"CONCRETE PVMT (10 in) ","SY",""]
[null,null,414.01055000000002,"CONCRETE PVMT (10.5 in) ","SY",""]
[null,null,414.01060000000001,"CONCRETE PVMT (11 in) ","SY",""]
[null,null,414.01060999999999,"CONCRETE PVMT (12 in) ","SY",{"$f":"IF(ISBLANK(B386),\"\",B386)","v":""}]
[null,"S",414.01062999999999,"RECYCLED CONCRETE PVMT (10 in) ","SY","S"]
[null,"S",414.01064000000002,"RECYCLED CONCRETE PVMT (11.5 in) ","SY","S"]
[null,"S",414.01065,"RECYCLED CONCRETE PVMT","SY","S"]
[null,"S",414.01069999999999,"DOWEL JOINTS","FT","S"]
[null,"S",414.01076,"PROFILOGRAPH","EA","S"]
[null,"S",414.02,"FLY ASH (CONC PVMT)","TON","S"]
[null,null,415.02010000000001,"CONC SLAB REPLACEMENT","SY",""]
[null,null,415.02015,"CONC PVMT SPALL REPAIR","SF",""]
[null,null,415.02015999999998,"CONC PVMT SPALL REPAIR","CF",""]
[null,null,415.02017000000001,"GRIND/TEXTURE CONC PVMT","SY",""]
[null,"S",415.02017999999998,"CROSS-STITCHING (CONC PVMT)","EA","S"]
[null,"S",415.02019999999999,"SUBSEAL GROUTING","CF","S"]
[null,"S",415.02021999999999,"SLAB LIFTING AND UNDERSEALING","LB","S"]
[null,"S",415.02023000000003,"SLAB LIFTING AND UNDERSEALING","CF","S"]
[null,"S",415.02024999999998,"HOLE DRILLING (CONC PVMT)","EA","S"]
[null,"S",415.0204,"GROOVING CONCRETE PAVEMENT","SY","S"]
[null,"S",415.02055000000001,"PENETRANT SEALANT (CONCRETE)","SY","S"]
[null,"D",416.01074999999997,"DOWEL BAR RETROFIT ","EA","D"]
[null,null,417.05,"SEALING CRACKS (CONC PVMT)","FT",""]
[null,null,417.05009999999999,"SEALING JOINTS (CONC PVMT)","FT",""]
[null,"S",417.05011000000002,"SEALING JOINTS","FT","S"]
[null,"S",417.06,"CRACK SEAL (PLANT MIX) < 3/4\"","FT","S"]
[null,"S",417.06009999999998,"CRACK SEAL (PLANT MIX) > 3/4\"","FT","S"]
[null,"S",417.06015000000002,"CRACK SEAL (PLANT MIX)","FT","S"]
[null,null,418.01015000000001,"RUMBLE STRIPS (MILLED)","MI",""]
[null,null,418.01015999999998,"RUMBLE STRIPS (ASPHALT)","MI",""]
[null,null,418.01017000000002,"RUMBLE STRIPS (CONCRETE)","MI",""]
[null,null,418.0102,"RUMBLE STRIP SECTION","EA",""]
[null,"S",499.02044999999998,"CRACK AND SEAT CONC PVMT","SY","S"]
[null,"S",499.03035,"REUSED SURFACING","TON","S"]
[null,"S",499.03039999999999,"REUSED SURFACING","CY","S"]
[null,"S",499.03044999999997,"REUSED SURFACING","SY","S"]
[null,"S",499.03046000000006,"RECLAIMED ASPHALT PAVEMENT WIDENING","CY","S"]
[null,"S",499.0333,"COLD IN-PLACE RECYCLING","SY","S"]
[null,"S",499.03332999999998,"HOT IN-PLACE RECYCLING","SY","S"]
[null,"S",499.03339999999997,"ASPHALT EMULSION (FDR)","TON","S"]
[null,"S",499.0335,"CEMENT (FDR)","TON","S"]
[null,"S",499.03354999999999,"FIBERS","TON","S"]
[null,"S",499.03356000000002,"SHOTBLAST/TEXTURE CONC PVMT","SY","S"]
[null,"S",499.03357,"RECLAIMED ASPHALT PAVEMENT","TON","S"]
[null,"S",499.03358000000003,"RECLAIMED ASPHALT PAVEMENT","CY","S"]
[null,"S",499.03359,"CONCRETE PAVEMENT SPECIAL","SY","S"]
[null,"S",499.03359999999998,"BITUMINOUS SEAL COAT","GAL","S"]
[null,"S",499.03365000000002,"CEMENT POLYMER SEAL COAT","SY","S"]
[null,null,501.01,"STRUCTURAL STEEL","LS",""]
[null,null,501.01004999999998,"STRUCTURAL STEEL","LB",""]
[null,null,502.01,"PRECAST CONCRETE MEMBERS","LS",""]
[null,null,502.01402999999999,"PRECAST BOX CULVERTS 4 X 3 ft ","FT",""]
[null,null,502.01503000000002,"PRECAST BOX CULVERTS 5 X 3 ft","FT",""]
[null,null,502.01504999999997,"PRECAST BOX CULVERTS 5 X 5 ft","FT",""]
[null,null,502.01603,"PRECAST BOX CULVERTS 6 X 3 ft","FT",""]
[null,null,502.01603999999998,"PRECAST BOX CULVERTS 6 X 4 ft ","FT",""]
[null,null,502.01605000000001,"PRECAST BOX CULVERTS 6 X 5 ft ","FT",""]
[null,null,502.01605999999998,"PRECAST BOX CULVERTS 6 X 6 ft ","FT",""]
[null,null,502.01702999999998,"PRECAST BOX CULVERTS 7 X 3 ft ","FT",""]
[null,null,502.01704000000001,"PRECAST BOX CULVERTS 7 X 4 ft ","FT",""]
[null,null,502.01704999999998,"PRECAST BOX CULVERTS 7 X 5 ft ","FT",""]
[null,null,502.01706000000001,"PRECAST BOX CULVERTS 7 X 6 ft ","FT",""]
[null,null,502.01706999999999,"PRECAST BOX CULVERTS 7 X 7 ft ","FT",""]
[null,null,502.01803000000001,"PRECAST BOX CULVERTS 8 X 3 ft ","FT",""]
[null,null,502.01803999999998,"PRECAST BOX CULVERTS 8 X 4 ft ","FT",""]
[null,null,502.01805000000002,"PRECAST BOX CULVERTS 8 X 5 ft ","FT",""]
[null,null,502.01805999999999,"PRECAST BOX CULVERTS 8 X 6 ft ","FT",""]
[null,null,502.01807000000002,"PRECAST BOX CULVERTS 8 X 7 ft ","FT",{"$f":"IF(ISBLANK(B450),\"\",B450)","v":""}]
[null,null,502.01808,"PRECAST BOX CULVERTS 8 X 8 ft ","FT",""]
[null,null,502.01904000000002,"PRECAST BOX CULVERTS 9 X 4 ft ","FT",""]
[null,null,502.01904999999999,"PRECAST BOX CULVERTS 9 X 5 ft ","FT",""]
[null,null,502.01906000000002,"PRECAST BOX CULVERTS 9 X 6 ft ","FT",""]
[null,null,502.01907,"PRECAST BOX CULVERTS 9 X 7 ft ","FT",""]
[null,null,502.01907999999997,"PRECAST BOX CULVERTS 9 X 8 ft ","FT",""]
[null,null,502.01909000000001,"PRECAST BOX CULVERTS 9 X 9 ft ","FT",""]
[null," ",502.11004000000003,"PRECAST BOX CULVERTS 10 X 4 ft ","FT"," "]
[null,null,502.11005,"PRECAST BOX CULVERTS 10 X 5 ft ","FT",""]
[null,null,502.11005999999998,"PRECAST BOX CULVERTS 10 X 6 ft ","FT",""]
[null,null,502.11007000000001,"PRECAST BOX CULVERTS 10 X 7 ft ","FT",""]
[null,null,502.11007999999998,"PRECAST BOX CULVERTS 10 X 8 ft ","FT",""]
[null,null,502.11009000000001,"PRECAST BOX CULVERTS 10 X 9 ft ","FT",""]
[null,null,502.11009999999999,"PRECAST BOX CULVERTS 10 X 10 ft ","FT",""]
[null,null,502.11011999999999,"PRECAST BOX CULVERTS 10 X 12 ft ","FT",""]
[null,null,502.11203,"PRECAST BOX CULVERTS 12 X 3 ft ","FT",""]
[null,null,502.11203999999998,"PRECAST BOX CULVERTS 12 X 4 ft ","FT",""]
[null,null,502.11205000000001,"PRECAST BOX CULVERTS 12 X 5 ft ","FT",""]
[null,null,502.11205999999999,"PRECAST BOX CULVERTS 12 X 6 ft ","FT",""]
[null,null,502.11207000000002,"PRECAST BOX CULVERTS 12 X 7 ft ","FT",""]
[null,null,502.11207999999999,"PRECAST BOX CULVERTS 12 X 8 ft ","FT",""]
[null,null,502.11209000000002,"PRECAST BOX CULVERTS 12 X 9 ft ","FT",""]
[null,null,502.1121,"PRECAST BOX CULVERTS 12 X 10 ft ","FT",""]
[null,null,502.11210999999997,"PRECAST BOX CULVERTS 12 X 11 ft ","FT",""]
[null,null,502.11212,"PRECAST BOX CULVERTS 12 X 12 ft ","FT",""]
[null,null,502.12004999999999,"PRECAST BOX CULVERTS 20 X 5 ft","FT",""]
[null,null,502.12007,"PRECAST BOX CULVERTS 20 X 7 ft","FT",""]
[null,null,502.12007999999997,"PRECAST BOX CULVERTS 20 X 8 ft","FT",""]
[null,null,502.12009999999998,"PRECAST BOX CULVERTS 20 X 10 ft ","FT",""]
[null,null,502.12011999999999,"PRECAST BOX CULVERTS 20 X 12 ft ","FT",""]
[null,null,502.14204999999998,"PRECAST BOX CULVERTS 14 X 5 ft","FT",""]
[null,null,502.14206000000001,"PRECAST BOX CULVERTS 14 X 6 ft","FT",""]
[null,null,502.14206999999999,"PRECAST BOX CULVERTS 14 X 7 ft ","FT",""]
[null,null,502.14210000000003,"PRECAST BOX CULVERTS 14 X 10 ft ","FT",""]
[null,null,502.14213999999998,"PRECAST BOX CULVERTS 14 x 14 ft","FT",""]
[null,"S",502.15012000000002,"PRECAST CONCRETE ARCH CULVERT 12 ft","FT","S"]
[null,null,502.16014999999999,"PRECAST BOX CULVERTS 16 X 14.5 ft","FT",""]
[null,null,502.40028000000001,"PRESTRESSED PRECAST CONC I GIRDER 28 in ","FT",""]
[null,null,502.40035999999998,"PRESTRESSED PRECAST CONC I GIRDER 36 in ","FT",""]
[null,null,502.40039999999999,"PRESTRESSED PRECAST CONC I GIRDER 40 in ","FT",""]
[null,null,502.40044999999998,"PRESTRESSED PRECAST CONC I GIRDER 45 in ","FT",""]
[null,null,502.40053999999998,"PRESTRESSED PRECAST CONC I GIRDER 54 in ","FT",""]
[null,null,502.40062999999998,"PRESTRESSED PRECAST CONC I GIRDER 63 in ","FT",""]
[null,null,502.40071999999998,"PRESTRESSED PRECAST CONC I GIRDER 72 in ","FT",""]
[null,null,502.40080999999998,"PRESTRESSED PRECAST CONC I GIRDER 81 in ","FT",""]
[null,null,502.50035000000003,"PRESTRESSED PRECAST CONC BULB T 35 in ","FT",""]
[null,null,502.50044000000003,"PRESTRESSED PRECAST CONC BULB T 44 in ","FT",""]
[null,null,502.50047000000001,"PRESTRESSED PRECAST CONC BULB T 47 in ","FT",""]
[null,null,502.50056000000001,"PRESTRESSED PRECAST CONC BULB T 56 in ","FT",""]
[null,null,502.50094000000001,"PRESTRESSED PRECAST CONC BULB T 94 in","FT",""]
[null,null,502.60016000000002,"PRESTRESSED PRECAST CONC TRI-DECK 16 in ","FT",""]
[null,null,502.60027000000002,"PRESTRESSED PRECAST CONC TRI-DECK 27 in ","FT",""]
[null,"S",502.70026999999999,"PRESTRESSED PRECAST CONCRETE BOX GIRDER 27 in","LS","S"]
[null,"S",502.70030000000003,"PRESTRESSED PRECAST CONCRETE BOX GIRDER 30 in","LS","S"]
[null,null,503.01,"BRIDGE RAILING","FT",""]
[null,null,503.01100000000002,"BRIDGE RAILING MODIFICATION","FT",""]
[null,null,503.012,"BRIDGE RAILING MODIFICATION","LS",""]
[null,"S",503.01209999999998,"TEMPORARY TRAFFIC RAILING MODIFICATION","LS","S"]
[null,"S",503.01220000000001,"BRIDGE RAILING ANCHOR BOLT REPAIR","EA","S"]
[null,null,503.01299999999998,"RESET BRIDGE RAILING","LS",""]
[null,null,503.01310000000001,"RESET BRIDGE RAILING","FT",""]
[null,null,503.01400000000001,"PEDESTRIAN RAILING","FT",""]
[null,null,503.01414999999997,"PEDESTRIAN RAILING MODIFICATION","LS",""]
[null,null,503.01420000000002,"PEDESTRIAN RAILING MODIFICATION","FT",{"$f":"IF(ISBLANK(B514),\"\",B514)","v":""}]
[null,"S",503.01420999999999,"PEDESTRIAN SAFETY RAILING","FT","S"]
[null,null,504.04,"PREDRILLED HOLES","FT",""]
[null,null,504.0401,"PILE SPLICES","EA",""]
[null,null,504.11041999999998,"STEEL PILING HP 10 X 42 ","FT",""]
[null,null,504.11252999999999,"STEEL PILING HP 12 X 53 ","FT",""]
[null,null,504.11273999999997,"STEEL PILING HP 12 X 74","FT",""]
[null,null,504.11284000000001,"STEEL PILING HP 12 X 84","FT",""]
[null,null,504.11401999999998,"STEEL PILING HP 14 X 102","FT",""]
[null,null,504.11417,"STEEL PILING HP 14 X 117","FT",""]
[null,null,504.11473000000001,"STEEL PILING HP 14 X 73","FT",""]
[null,null,504.11489,"STEEL PILING HP 14 X 89","FT",""]
[null,"S",504.11599999999999,"STEEL SHEET PILING","LS","S"]
[null,null,504.11615999999998,"STEEL SHEET PILING (SM 16.0)","SF",""]
[null,null,504.11630000000002,"STEEL SHEET PILING (SM 30.0)","SF",""]
[null,null,505.01,"BRIDGE BARRIER ","FT",""]
[null,null,505.01100000000002,"BRIDGE MEDIAN BARRIER","FT",""]
[null,null,505.06,"MEDIAN BARRIER 32 in","FT",""]
[null,null,505.06004999999999,"MEDIAN BARRIER 42 in ","FT",""]
[null,null,505.06099999999998,"SHOULDER BARRIER","FT",""]
[null,null,506.01017999999999,"DRILLED SHAFT FOUNDATIONS 18 in ","FT",""]
[null,null,506.01024000000001,"DRILLED SHAFT FOUNDATIONS 24 in ","FT",""]
[null,null,506.01029999999997,"DRILLED SHAFT FOUNDATIONS 30 in","FT",""]
[null,null,506.01035999999999,"DRILLED SHAFT FOUNDATIONS 36 in ","FT",""]
[null,null,506.01042000000001,"DRILLED SHAFT FOUNDATIONS 42 in ","FT",""]
[null,null,506.01047999999997,"DRILLED SHAFT FOUNDATIONS 48 in ","FT",""]
[null,null,506.01053999999999,"DRILLED SHAFT FOUNDATIONS 54 in ","FT",""]
[null,null,506.01060000000001,"DRILLED SHAFT FOUNDATIONS 60 in ","FT",""]
[null,null,506.01065999999997,"DRILLED SHAFT FOUNDATIONS 66 in ","FT",""]
[null,null,506.01071999999999,"DRILLED SHAFT FOUNDATIONS 72 in ","FT",""]
[null,null,506.01078000000001,"DRILLED SHAFT FOUNDATIONS 78 in ","FT",""]
[null,null,507.01,"REINFORCED CONC APPROACH SLABS","SY",""]
[null,null,507.01100000000002,"BRIDGE APPROACH BACKFILL ","CY",""]
[null,null,508.01,"REINFORCED CONC SLOPE PAVING","SY",""]
[null,null,508.01101,"SLOPE PAVING REPAIR/MODIFICATION","SY",""]
[null,null,511.01,"GABIONS","CY",""]
[null,null,511.02,"GABIONS","SY",""]
[null,null,511.04,"FILTER AGGREGATE","CY",""]
[null,null,511.05,"HAND-PLACED RIPRAP","CY",""]
[null,null,511.06,"MACHINE-PLACED RIPRAP","CY",""]
[null,"S",511.06020000000001,"SLIDE STABILIZATION ROCK (SSR)","CY","S"]
[null,null,511.07,"WIRE-ENCL RIPRAP","SY",""]
[null,"S",511.08,"GROUTED RIPRAP","CY","S"]
[null,"S",511.09,"ARTICULATED BLOCK RIPRAP","SY","S"]
[null,"S",512.01,"EXPANSION JOINT (REPAIR/MODIFICATION)","LS","S"]
[null,"S",512.01009999999997,"BEARING DEVICE MODIFICATION","LS","S"]
[null,"S",512.01011000000005,"EXPANSION JOINT (NOSED)","FT","S"]
[null,"S",512.01012000000003,"EXPANSION JOINT (GLAND)","FT","S"]
[null,"S",512.01013,"EXPANSION JOINT (MODULAR)","FT","S"]
[null,"S",512.01022,"EXPANSION JOINT (ASPHALTIC)","FT","S"]
[null,"S",512.01022999999998,"JOINT SEALS","FT","S"]
[null,null,512.0104,"COMPRESSED JOINT MATERIAL","FT",""]
[null,null,512.01049999999998,"ELASTOMERIC COMP JOINT SEAL","FT",""]
[null,null,513.00004999999999,"CLASS A CONCRETE","LS",""]
[null,null,513.00009999999997,"CLASS A CONCRETE","CY",""]
[null,null,513.00014999999996,"CLASS B CONCRETE","LS",""]
[null,null,513.00019999999995,"CLASS B CONCRETE","CY",""]
[null,null,513.00025000000005,"CLASS S CONCRETE","LS",""]
[null,null,513.00300000000004,"CLASS S CONCRETE","CY",""]
[null,"S",513.01300000000003,"HIGH STRENGTH CONCRETE","LS","S"]
[null,"S",513.01499999999999,"GROUT","LS","S"]
[null,"S",513.01509999999996,"GROUT","CY","S"]
[null,"S",513.02,"SHOTCRETE","SY","S"]
[null,"S",513.02009999999996,"SHOTCRETE","CY","S"]
[null,null,514.00004999999999,"MECHANICAL SPLICES","LS",{"$f":"IF(ISBLANK(B578),\"\",B578)","v":""}]
[null,null,514.00009999999997,"MECHANICAL SPLICES","EA",""]
[null,null,514.00014999999996,"REINFORCING STEEL","LS",""]
[null,null,514.00019999999995,"REINFORCING STEEL","LB",""]
[null,null,514.00025000000005,"REINFORCING STEEL (COATED)","LS",""]
[null,null,514.00030000000004,"REINFORCING STEEL (COATED)","LB",""]
[null,null,515.02710000000002,"BRIDGE DECK REPAIR CLASS I-A","SY",""]
[null,null,515.02719999999999,"BRIDGE DECK REPAIR CLASS I-B","SY",""]
[null,null,515.02729999999997,"BRIDGE DECK REPAIR CLASS II-A","SY",""]
[null,null,515.02739999999994,"BRIDGE DECK REPAIR CLASS II-B","SY",""]
[null,"S",515.02750000000003,"BRIDGE DECK REPAIR","SY","S"]
[null,null,515.02800000000002,"SILICA FUME MODIFIED CONCRETE","CY",""]
[null,null,515.02805000000001,"SILICA FUME MODIFIED CONCRETE","LS",""]
[null,"S",515.02809999999999,"BRIDGE DECK REPAIR, HYDRO-DEMOLITION","SY","S"]
[null,null,516.42010000000005,"PAINT REPAIR-STRUCTURAL STEEL","LS",""]
[null,null,516.42012,"PAINT REPAIR-STRUCTURAL STEEL","SF",""]
[null,null,516.42020000000002,"PAINT REPAIR-BRIDGE RAILING","LS",""]
[null,null,516.42025000000001,"PAINT REPAIR-BRIDGE RAILING","FT",""]
[null,null,516.4203,"PAINT REPAIR-STEEL PILING","LS",""]
[null,null,516.42034999999998,"PAINT REPAIR-STEEL PILING","SF",""]
[null,"S",599,"PRECAST WALL COMPONENTS","SF","S"]
[null,"S",599.00001999999995,"PRECAST WALL COMPONENT SYSTEM","SF","S"]
[null,"S",599.00004000000001,"STEEL BIN - TYPE RETAINING WALL","SF","S"]
[null,"S",599.00026000000003,"DOWELED ANCHOR JOINTS","FT","S"]
[null,"S",599.00027999999998,"ELASTOMERIC BEARING PADS","EA","S"]
[null,"S",599.00030000000004,"PTFE SLIDE BEARINGS","EA","S"]
[null,"S",599.00031999999999,"BRIDGE DECK MEMBRANE","SY","S"]
[null,"S",599.00034000000005,"BRIDGE DECK WEATHER PROOFING","LS","S"]
[null,"S",599.00036,"BRIDGE DECK SEALER","SY","S"]
[null,"S",599.00044000000003,"METHYL METHACRYLATE CONCRETE OVERLAY","SY","S"]
[null,"S",599.00045999999998,"BRIDGE DECK OVERLAY (EPOXY CONCRETE)","SF","S"]
[null,"S",599.00046999999995,"BRIDGE DECK OVERLAY (EPOXY)","SY","S"]
[null,"S",599.00048000000004,"BRIDGE DECK OVERLAY (POLYESTER CONCRETE)","SF","S"]
[null,"S",599.00049999999999,"REPAIR - BRIDGE","LS","S"]
[null,"S",599.00052000000005,"REPAIR - BOX CULVERT","SF","S"]
[null,"S",599.00054,"REPAIR - BOX CULVERT","LS","S"]
[null,"S",599.00055999999995,"REPAIR - BRIDGE RAILING","LS","S"]
[null,"S",599.00058109999998,"REPAIR - BRIDGE RAILING","FT","S"]
[null,"S",599.00058999999999,"REPAIR-BRIDGE COLUMNS","LS","S"]
[null,"S",599.00059999999996,"REPAIR - BRIDGE WINGWALL","LS","S"]
[null,"S",599.00062000000003,"REPAIR - GIRDERS","LS","S"]
[null,"S",599.00063999999998,"REPAIR - GIRDERS","EA","S"]
[null,"S",599.00066000000004,"REPAIR - BENT CAP","LS","S"]
[null,"S",599.00067999999999,"TEMPORARY BENTS","LS","S"]
[null,"S",599.00070000000005,"REPAIR - PIER CAP","LS","S"]
[null,"S",599.00072,"REPAIR - PIER CAP END","CF","S"]
[null,"S",599.00073999999995,"REPAIR - ABUTMENT","LS","S"]
[null,"S",599.00076000000001,"CONCRETE REPAIR MATERIAL","CF","S"]
[null,"S",599.00077999999996,"BRIDGE CONCRETE REPAIR","LS","S"]
[null,"S",599.00080000000003,"BRIDGE CONCRETE REPAIR","SF","S"]
[null,"S",599.00084000000004,"CRACK REPAIR","HR","S"]
[null,"S",599.00088000000005,"ABUTMENT RAISING","LS","S"]
[null,"S",599.0009,"SUPERSTRUCTURE RAISING","LS","S"]
[null,"S",599.00091999999995,"APPROACH SLAB REPAIR","LS","S"]
[null,"S",599.00098000000003,"BRIDGE ERECTION","LS","S"]
[null,"S",599.00099999999998,"BULKHEADS","LS","S"]
[null,"S",599.00102000000004,"STRUCTURAL TIMBER          [DO NOT USE]","MBM","S"]
[null,"S",599.00103999999999,"STEEL CRIBBING","SF","S"]
[null,"S",599.00106000000005,"TIMBER CRIBBING","SF","S"]
[null,"S",599.00109999999995,"POST-TENSIONING CONCRETE","LS","S"]
[null,"S",599.00112000000001,"POST-TENSIONED PRECAST CONCRETE RETAINING WALLS","LS","S"]
[null,null,603.01005999999995,"PIPE 6 in","FT",""]
[null,null,603.01009999999997,"PIPE 10 in","FT",""]
[null,null,603.01012000000003,"PIPE 12 in ","FT",""]
[null,null,603.01014999999995,"PIPE 15 in  ","FT",{"$f":"IF(ISBLANK(B642),\"\",B642)","v":""}]
[null,null,603.01017999999999,"PIPE 18 in  ","FT",""]
[null,null,603.01023999999995,"PIPE 24 in  ","FT",""]
[null,null,603.01030000000003,"PIPE 30 in  ","FT",""]
[null,null,603.01035999999999,"PIPE 36 in  ","FT",""]
[null,null,603.01041999999995,"PIPE 42 in  ","FT",""]
[null,null,603.01048000000003,"PIPE 48 in  ","FT",""]
[null,null,603.01053999999999,"PIPE 54 in  ","FT",""]
[null,null,603.01059999999995,"PIPE 60 in  ","FT",""]
[null,null,603.01066000000003,"PIPE 66 in  ","FT",""]
[null,null,603.01071999999999,"PIPE 72 in  ","FT",""]
[null,null,603.01077999999995,"PIPE 78 in  ","FT",""]
[null,null,603.01084000000003,"PIPE 84 in  ","FT",""]
[null,null,603.01089999999999,"PIPE 90 in  ","FT",""]
[null,null,603.01095999999995,"PIPE 96 in  ","FT",""]
[null,null,603.01102000000003,"PIPE 102 in  ","FT",""]
[null,null,603.01107999999999,"PIPE 108 in  ","FT",""]
[null,null,603.01113999999995,"PIPE 114 in  ","FT",""]
[null,null,603.01120000000003,"PIPE 120 in  ","FT",""]
[null,null,603.01143999999999,"PIPE 144 in  ","FT",""]
[null,null,603.03012000000001,"PIPE FE SECT 12 in  ","EA",""]
[null,null,603.03015000000005,"PIPE FE SECT 15 in  ","EA",""]
[null,null,603.03017999999997,"PIPE FE SECT 18 in  ","EA",""]
[null,null,603.03024000000005,"PIPE FE SECT 24 in  ","EA",""]
[null,null,603.03030000000001,"PIPE FE SECT 30 in  ","EA",""]
[null,null,603.03035999999997,"PIPE FE SECT 36 in  ","EA",""]
[null,null,603.03042000000005,"PIPE FE SECT 42 in  ","EA",""]
[null,null,603.03048000000001,"PIPE FE SECT 48 in  ","EA",""]
[null,null,603.03053999999997,"PIPE FE SECT 54 in  ","EA",""]
[null,null,603.03060000000005,"PIPE FE SECT 60 in  ","EA",""]
[null,null,603.03066000000001,"PIPE FE SECT 66 in  ","EA",""]
[null,null,603.03071999999997,"PIPE FE SECT 72 in  ","EA",""]
[null,null,603.03078000000005,"PIPE FE SECT 78 in ","EA",""]
[null,null,603.03084000000001,"PIPE FE SECT 84 in  ","EA",""]
[null,null,603.03089999999997,"PIPE FE SECT 90 in  ","EA",""]
[null,null,603.10017000000005,"PIPE ARCH 17 X 13 in ","FT",""]
[null,null,603.10020999999995,"PIPE ARCH 21 X 15 in ","FT",""]
[null,null,603.10023999999999,"PIPE ARCH 24 X 18 in ","FT",""]
[null,null,603.10028,"PIPE ARCH 28 X 20 in ","FT",""]
[null,null,603.10035000000005,"PIPE ARCH 35 X 24 in ","FT",""]
[null,null,603.10041999999999,"PIPE ARCH 42 X 29 in ","FT",""]
[null,null,603.10049000000004,"PIPE ARCH 49 X 33 in ","FT",""]
[null,null,603.10056999999995,"PIPE ARCH 57 X 38 in ","FT",""]
[null,null,603.10064,"PIPE ARCH 64 X 43 in ","FT",""]
[null,null,603.10071000000005,"PIPE ARCH 71 X 47 in ","FT",""]
[null,null,603.10073,"PIPE ARCH 73 X 55 in ","FT",""]
[null,null,603.10081000000002,"PIPE ARCH 81 X 59 in ","FT",""]
[null,null,603.10086999999999,"PIPE ARCH 87 X 63 in ","FT",""]
[null,null,603.10095000000001,"PIPE ARCH 95 X 67 in ","FT",""]
[null,null,603.10103000000004,"PIPE ARCH 103 X 71 in ","FT",""]
[null,null,603.10112000000004,"PIPE ARCH 112 X 75 in ","FT",""]
[null,null,603.10117000000002,"PIPE ARCH 117 X 79 in ","FT",""]
[null,null,603.10127999999997,"PIPE ARCH 128 X 83 in ","FT",""]
[null,null,603.10136999999997,"PIPE ARCH 137 X 87 in ","FT",""]
[null,null,603.10141999999996,"PIPE ARCH 142 X 91 in ","FT",""]
[null,null,603.12017000000003,"PIPE ARCH  FE SECT 17 X 13 in ","EA",""]
[null,null,603.12021000000004,"PIPE ARCH  FE SECT 21 X 15 in ","EA",""]
[null,null,603.12023999999997,"PIPE ARCH  FE SECT 24 X 18 in ","EA",""]
[null,null,603.12027999999998,"PIPE ARCH  FE SECT 28 X 20 in ","EA",""]
[null,null,603.12035000000003,"PIPE ARCH  FE SECT 35 X 24 in ","EA",""]
[null,null,603.12041999999997,"PIPE ARCH  FE SECT 42 X 29 in ","EA",""]
[null,null,603.12049000000002,"PIPE ARCH  FE SECT 49 X 33 in ","EA",""]
[null,null,603.12057000000004,"PIPE ARCH  FE SECT 57 X 38 in ","EA",""]
[null,null,603.12063999999998,"PIPE ARCH  FE SECT 64 X 43 in ","EA",""]
[null,null,603.12071000000003,"PIPE ARCH  FE SECT 71 X 47 in ","EA",{"$f":"IF(ISBLANK(B706),\"\",B706)","v":""}]
[null,null,603.12072999999998,"PIPE ARCH  FE SECT 73 X 55 in ","EA",""]
[null,null,603.12081000000001,"PIPE ARCH  FE SECT 81 X 59 in ","EA",""]
[null,null,603.20011999999997,"RCP 12 in  ","FT",""]
[null,null,603.20015000000001,"RCP 15 in  ","FT",""]
[null,null,603.20018000000005,"RCP 18 in  ","FT",""]
[null,null,603.20020999999997,"RCP 21 in  ","FT",""]
[null,null,603.20024000000001,"RCP 24 in  ","FT",""]
[null,null,603.20029999999997,"RCP 30 in  ","FT",""]
[null,null,603.20036000000005,"RCP 36 in  ","FT",""]
[null,null,603.20042000000001,"RCP 42 in  ","FT",""]
[null,null,603.20047999999997,"RCP 48 in  ","FT",""]
[null,null,603.20054000000005,"RCP 54 in  ","FT",""]
[null,null,603.20060000000001,"RCP 60 in  ","FT",""]
[null,null,603.20065999999997,"RCP 66 in  ","FT",""]
[null,null,603.20072000000005,"RCP 72 in  ","FT",""]
[null,null,603.20078000000001,"RCP 78 in  ","FT",""]
[null,null,603.20083999999997,"RCP 84 in  ","FT",""]
[null,null,603.20090000000005,"RCP 90 in  ","FT",""]
[null,null,603.20096000000001,"RCP 96 in  ","FT",""]
[null,null,603.20101999999997,"RCP 102 in  ","FT",""]
[null,null,603.20108000000005,"RCP 108 in  ","FT",""]
[null,null,603.20119999999997,"RCP 120 in  ","FT",""]
[null,null,603.22011999999995,"RCP FE SECT 12 in  ","EA",""]
[null,null,603.22014999999999,"RCP FE SECT 15 in  ","EA",""]
[null,null,603.22018000000003,"RCP FE SECT 18 in  ","EA",""]
[null,null,603.22023999999999,"RCP FE SECT 24 in  ","EA",""]
[null,null,603.22029999999995,"RCP FE SECT 30 in  ","EA",""]
[null,null,603.22036000000003,"RCP FE SECT 36 in  ","EA",""]
[null,null,603.22041999999999,"RCP FE SECT 42 in  ","EA",""]
[null,null,603.22047999999995,"RCP FE SECT 48 in  ","EA",""]
[null,null,603.22054000000003,"RCP FE SECT 54 in  ","EA",""]
[null,null,603.22059999999999,"RCP FE SECT 60 in  ","EA",""]
[null,null,603.22065999999995,"RCP FE SECT 66 in  ","EA",""]
[null,null,603.22072000000003,"RCP FE SECT 72 in  ","EA",""]
[null,null,603.22077999999999,"RCP FE SECT 78 in  ","EA",""]
[null,null,603.22083999999995,"RCP FE SECT 84 in  ","EA",""]
[null,null,603.22090000000003,"RCP FE SECT 90 in  ","EA",""]
[null,null,603.30021999999997,"RCP ARCH 22 X 14 in  ","FT",""]
[null,null,603.30029000000002,"RCP ARCH 29 X 18 in  ","FT",""]
[null,null,603.30035999999996,"RCP ARCH 36 X 23 in  ","FT",""]
[null,null,603.30043999999998,"RCP ARCH 44 X 27 in  ","FT",""]
[null,null,603.30051000000003,"RCP ARCH 51 X 31 in  ","FT",""]
[null,null,603.30059000000006,"RCP ARCH 59 X 36 in  ","FT",""]
[null,null,603.30065000000002,"RCP ARCH 65 X 40 in  ","FT",""]
[null,null,603.30073000000004,"RCP ARCH 73 X 45 in  ","FT",""]
[null,null,603.30088000000001,"RCP ARCH 88 X 54 in  ","FT",""]
[null,null,603.30101999999999,"RCP ARCH 102 X 62 in","FT",""]
[null,null,603.30121999999994,"RCP ARCH 122 X 78 in","FT",""]
[null,null,603.30154000000005,"RCP ARCH 154 X 97 in  ","FT",""]
[null,null,603.32021999999995,"RCP ARCH FE SECT 22 X 14 in  ","EA",""]
[null,null,603.32029,"RCP ARCH FE SECT 29 X 18 in  ","EA",""]
[null,null,603.32036000000005,"RCP ARCH FE SECT 36 X 23 in  ","EA",""]
[null,null,603.32043999999996,"RCP ARCH FE SECT 44 X 27 in  ","EA",""]
[null,null,603.32051000000001,"RCP ARCH FE SECT 51 X 31 in  ","EA",""]
[null,null,603.32059000000004,"RCP ARCH FE SECT 59 X 36 in  ","EA",""]
[null,null,603.32065,"RCP ARCH FE SECT 65 X 40 in  ","EA",""]
[null,null,603.32073000000003,"RCP ARCH FE SECT 73 X 45 in  ","EA",""]
[null,null,603.32087999999999,"RCP ARCH FE SECT 88 X 54 in  ","EA",""]
[null,null,603.32101999999998,"RCP ARCH FE SECT 102 X 62 in","EA",""]
[null,null,603.40022999999997,"RCP ELLIPTICAL 23 X 14 in  ","FT",""]
[null,null,603.40030000000002,"RCP ELLIPTICAL 30 X 19 in  ","FT",""]
[null,null,603.40034000000003,"RCP ELLIPTICAL 34 X 22 in  ","FT",""]
[null,null,603.40038000000004,"RCP ELLIPTICAL 38 X 24 in  ","FT",""]
[null,null,603.40042000000005,"RCP ELLIPTICAL 42 X 27 in  ","FT",{"$f":"IF(ISBLANK(B770),\"\",B770)","v":""}]
[null,null,603.40044999999998,"RCP ELLIPTICAL 45 X 29 in  ","FT",""]
[null,null,603.40048999999999,"RCP ELLIPTICAL 49 X 32 in  ","FT",""]
[null,null,603.40053,"RCP ELLIPTICAL 53 X 34 in  ","FT",""]
[null,null,603.40060000000005,"RCP ELLIPTICAL 60 X 38 in  ","FT",""]
[null,null,603.40067999999997,"RCP ELLIPTICAL 68 X 43 in  ","FT",""]
[null,null,603.40075999999999,"RCP ELLIPTICAL 76 X 48 in  ","FT",""]
[null,null,603.40083000000004,"RCP ELLIPTICAL 83 X 53 in  ","FT",""]
[null,null,603.40090999999995,"RCP ELLIPTICAL 91 X 58 in  ","FT",""]
[null,null,603.40098,"RCP ELLIPTICAL 98 X 63 in  ","FT",""]
[null,null,603.40106000000003,"RCP ELLIPTICAL 106 X 68 in  ","FT",""]
[null,null,603.40112999999997,"RCP ELLIPTICAL 113 X 72 in  ","FT",""]
[null,null,603.40120999999999,"RCP ELLIPTICAL 121 X 77 in  ","FT",""]
[null,null,603.40128000000004,"RCP ELLIPTICAL 128 X 82 in  ","FT",""]
[null,null,603.40135999999995,"RCP ELLIPTICAL 136 X 87 in  ","FT",""]
[null,null,603.40143,"RCP ELLIPTICAL 143 X 92 in  ","FT",""]
[null,null,603.40151000000003,"RCP ELLIPTICAL 151 X 97 in  ","FT",""]
[null,null,603.41022999999996,"RCP ELLIPTICAL FE SECT 23 X 14 in  ","EA",""]
[null,null,603.41030000000001,"RCP ELLIPTICAL FE SECT 30 X 19 in  ","EA",""]
[null,null,603.41038000000003,"RCP ELLIPTICAL FE SECT 38 X 24 in  ","EA",""]
[null,null,603.41044999999997,"RCP ELLIPTICAL FE SECT 45 X 29 in  ","EA",""]
[null,null,603.41048999999998,"RCP ELLIPTICAL FE SECT 49 X 32 in  ","EA",""]
[null,null,603.41052999999999,"RCP ELLIPTICAL FE SECT 53 X 34 in  ","EA",""]
[null,null,603.41060000000004,"RCP ELLIPTICAL FE SECT 60 X 38 in  ","EA",""]
[null,null,603.41067999999996,"RCP ELLIPTICAL FE SECT 68 X 43 in  ","EA",""]
[null,null,603.41075999999998,"RCP ELLIPTICAL FE SECT 76 X 48 in  ","EA",""]
[null,null,603.41083000000003,"RCP ELLIPTICAL FE SECT 83 X 53 in  ","EA",""]
[null,null,603.50005999999996,"CMP 6 in  ","FT",""]
[null,null,603.50008000000003,"CMP 8 in  ","FT",""]
[null,null,603.50012000000004,"CMP 12 in  ","FT",""]
[null,null,603.50014999999996,"CMP 15 in  ","FT",""]
[null,null,603.50018,"CMP 18 in  ","FT",""]
[null,null,603.50023999999996,"CMP 24 in  ","FT",""]
[null,null,603.50030000000004,"CMP 30 in  ","FT",""]
[null,null,603.50036,"CMP 36 in  ","FT",""]
[null,null,603.50041999999996,"CMP 42 in  ","FT",""]
[null,null,603.50048000000004,"CMP 48 in  ","FT",""]
[null,null,603.50054,"CMP 54 in  ","FT",""]
[null,null,603.50059999999996,"CMP 60 in  ","FT",""]
[null,null,603.50066000000004,"CMP 66 in  ","FT",""]
[null,null,603.50072,"CMP 72 in  ","FT",""]
[null,null,603.50077999999996,"CMP 78 in  ","FT",""]
[null,null,603.50084000000004,"CMP 84 in  ","FT",""]
[null,null,603.5009,"CMP 90 in  ","FT",""]
[null,null,603.50095999999996,"CMP 96 in  ","FT",""]
[null,null,603.50102000000004,"CMP 102 in  ","FT",""]
[null,null,603.50108,"CMP 108 in  ","FT",""]
[null,null,603.50113999999996,"CMP 114 in  ","FT",""]
[null,null,603.50120000000004,"CMP 120 in  ","FT",""]
[null,null,603.52012000000002,"CMP FE SECT 12 in  ","EA",""]
[null,null,603.52014999999994,"CMP FE SECT 15 in  ","EA",""]
[null,null,603.52017999999998,"CMP FE SECT 18 in  ","EA",""]
[null,null,603.52023999999994,"CMP FE SECT 24 in  ","EA",""]
[null,null,603.52030000000002,"CMP FE SECT 30 in  ","EA",""]
[null,null,603.52035999999998,"CMP FE SECT 36 in  ","EA",""]
[null,null,603.52041999999994,"CMP FE SECT 42 in  ","EA",""]
[null,null,603.52048000000002,"CMP FE SECT 48 in  ","EA",""]
[null,null,603.52053999999998,"CMP FE SECT 54 in  ","EA",""]
[null,null,603.52059999999994,"CMP FE SECT 60 in  ","EA",""]
[null,null,603.52066000000002,"CMP FE SECT 66 in  ","EA",""]
[null,null,603.52071999999998,"CMP FE SECT 72 in  ","EA",""]
[null,null,603.52077999999995,"CMP FE SECT 78 in  ","EA",""]
[null,null,603.52084000000002,"CMP FE SECT 84 in  ","EA",""]
[null,null,603.53012000000001,"SME SECT 12 in  ","EA",""]
[null,null,603.53015000000005,"SME SECT 15 in  ","EA",{"$f":"IF(ISBLANK(B834),\"\",B834)","v":""}]
[null,null,603.53017999999997,"SME SECT 18 in  ","EA",""]
[null,null,603.53021000000001,"SME SECT 21 in  ","EA",""]
[null,null,603.53024000000005,"SME SECT 24 in  ","EA",""]
[null,null,603.53030000000001,"SME SECT 30 in  ","EA",""]
[null,null,603.53035999999997,"SME SECT 36 in  ","EA",""]
[null,null,603.53042000000005,"SME SECT 42 in  ","EA",""]
[null,null,603.53048000000001,"SME SECT 48 in  ","EA",""]
[null,null,603.53053999999997,"SME SECT 54 in  ","EA",""]
[null,null,603.53060000000005,"SME SECT 60 in  ","EA",""]
[null,null,603.55015000000003,"SME SECT 15 in W/ GRATE ","EA",""]
[null,null,603.55017999999995,"SME SECT 18 in W/ GRATE ","EA",""]
[null,null,603.55020999999999,"SME SECT 21 in W/ GRATE ","EA",""]
[null,null,603.55024000000003,"SME SECT 24 in W/ GRATE ","EA",""]
[null,null,603.55029999999999,"SME SECT 30 in W/ GRATE ","EA",""]
[null,null,603.55035999999996,"SME SECT 36 in W/ GRATE ","EA",""]
[null,null,603.55042000000003,"SME SECT 42 in W/ GRATE ","EA",""]
[null,null,603.55047999999999,"SME SECT 48 in W/ GRATE ","EA",""]
[null,null,603.55053999999996,"SME SECT 54 in W/ GRATE ","EA",""]
[null,null,603.55060000000003,"SME SECT 60 in W/ GRATE ","EA",""]
[null,null,603.60017000000005,"CMP ARCH 17 X 13 in  ","FT",""]
[null,null,603.60020999999995,"CMP ARCH 21 X 15 in  ","FT",""]
[null,null,603.60023999999999,"CMP ARCH 24 X 18 in  ","FT",""]
[null,null,603.60028,"CMP ARCH 28 X 20 in  ","FT",""]
[null,null,603.60035000000005,"CMP ARCH 35 X 24 in  ","FT",""]
[null,null,603.60036000000002,"CMP ARCH 36 X 24 in  ","FT",""]
[null,null,603.60041999999999,"CMP ARCH 42 X 29 in  ","FT",""]
[null,null,603.60049000000004,"CMP ARCH 49 X 33 in  ","FT",""]
[null,null,603.60056999999995,"CMP ARCH 57 X 38 in  ","FT",""]
[null,null,603.60059999999999,"CMP ARCH 60 X 36 in  ","FT",""]
[null,null,603.60060999999996,"CMP ARCH 60 X 46 in","FT",""]
[null,null,603.60064,"CMP ARCH 64 X 43 in  ","FT",""]
[null,null,603.60065999999995,"CMP ARCH 66 X 51 in","FT",""]
[null,null,603.60071000000005,"CMP ARCH 71 X 47 in  ","FT",""]
[null,null,603.60073,"CMP ARCH 73 X 55 in  ","FT",""]
[null,null,603.60081000000002,"CMP ARCH 81 X 59 in  ","FT",""]
[null,null,603.60082999999997,"CMP ARCH 83 X 57 in  ","FT",""]
[null,null,603.60086999999999,"CMP ARCH 87 X 63 in  ","FT",""]
[null,null,603.60095000000001,"CMP ARCH 95 X 67 in  ","FT",""]
[null,null,603.60103000000004,"CMP ARCH 103 X 71 in  ","FT",""]
[null,null,603.60112000000004,"CMP ARCH 112 X 75 in  ","FT",""]
[null,null,603.60117000000002,"CMP ARCH 117 X 79 in  ","FT",""]
[null,null,603.60127999999997,"CMP ARCH 128 X 83 in  ","FT",""]
[null,null,603.60136999999997,"CMP ARCH 137 X 87 in  ","FT",""]
[null,null,603.60141999999996,"CMP ARCH 142 X 91 in  ","FT",""]
[null,null,603.62017000000003,"CMP ARCH FE SECT 17 X 13 in  ","EA",""]
[null,null,603.62021000000004,"CMP ARCH FE SECT 21 X 15 in  ","EA",""]
[null,null,603.62023999999997,"CMP ARCH FE SECT 24 X 18 in  ","EA",""]
[null,null,603.62027999999998,"CMP ARCH FE SECT 28 X 20 in  ","EA",""]
[null,null,603.62035000000003,"CMP ARCH FE SECT 35 X 24 in  ","EA",""]
[null,null,603.62036000000001,"CMP ARCH FE SECT 36 X 24 in  ","EA",""]
[null,null,603.62041999999997,"CMP ARCH FE SECT 42 X 29 in  ","EA",""]
[null,null,603.62049000000002,"CMP ARCH FE SECT 49 X 33 in  ","EA",""]
[null,null,603.62057000000004,"CMP ARCH FE SECT 57 X 38 in    ","EA",""]
[null,null,603.62059999999997,"CMP ARCH FE SECT 60 X 36 in","EA",""]
[null,null,603.62061000000006,"CMP ARCH FE SECT 60 X 46 in","EA",""]
[null,null,603.62063999999998,"CMP ARCH FE SECT 64 X 43 in  ","EA",""]
[null,null,603.62066000000004,"CMP ARCH FE SECT 66 X 51 in","EA",""]
[null,null,603.62071000000003,"CMP ARCH FE SECT 71 X 47 in  ","EA",""]
[null,null,603.62072999999998,"CMP ARCH FE SECT 73 X 55 in  ","EA",""]
[null,null,603.62103999999999,"CMP ARCH FE SECT 104 X 72 in  ","EA",""]
[null,null,603.64121,"SME ARCH SECT 21 X 15 in ","EA",""]
[null,null,603.64124000000004,"SME ARCH SECT 24 X 18 in ","EA",""]
[null,null,603.64128000000005,"SME ARCH SECT 28 X 20 in ","EA",""]
[null,null,603.64134999999999,"SME ARCH SECT 35 X 24 in ","EA",{"$f":"IF(ISBLANK(B898),\"\",B898)","v":""}]
[null,null,603.64142000000004,"SME ARCH SECT 42 X 29 in ","EA",""]
[null,null,603.64148999999998,"SME ARCH SECT 49 X 33 in ","EA",""]
[null,null,603.64157,"SME ARCH SECT 57 X 38 in ","EA",""]
[null,null,603.64164000000005,"SME ARCH SECT 64 X 43 in ","EA",""]
[null,null,603.64170999999999,"SME ARCH SECT 71 X 47 in ","EA",""]
[null,null,603.64183000000003,"SME ARCH SECT 83 X 57 in ","EA",""]
[null,null,603.64220999999998,"SME ARCH SECT 21 X 15 in W/ GRATE ","EA",""]
[null,null,603.64224000000002,"SME ARCH SECT 24 X 18 in W/ GRATE ","EA",""]
[null,null,603.64228000000003,"SME ARCH SECT 28 X 20 in W/ GRATE ","EA",""]
[null,null,603.64234999999996,"SME ARCH SECT 35 X 24 in W/ GRATE ","EA",""]
[null,null,603.64242000000002,"SME ARCH SECT 42 X 29 in W/ GRATE ","EA",""]
[null,null,603.64248999999995,"SME ARCH SECT 49 X 33 in W/ GRATE ","EA",""]
[null,null,603.64256999999998,"SME ARCH SECT 57 X 38 in W/ GRATE ","EA",""]
[null,null,603.64264000000003,"SME ARCH SECT 64 X 43 in W/ GRATE ","EA",""]
[null,null,603.64270999999997,"SME ARCH SECT 71 X 47 in W/ GRATE ","EA",""]
[null,null,603.64283,"SME ARCH SECT 83 X 57 in W/ GRATE ","EA",""]
[null,"S",603.65015000000005,"PVC LINER PIPE 15 in  ","FT","S"]
[null,"S",603.65017999999998,"PVC LINER PIPE 18 in  ","FT","S"]
[null,"S",603.65021000000002,"PVC LINER PIPE 21 in  ","FT","S"]
[null,"S",603.65024000000005,"PVC LINER PIPE 24 in  ","FT","S"]
[null,"S",603.65030000000002,"PVC LINER PIPE 30 in  ","FT","S"]
[null,"S",603.65035999999998,"PVC LINER PIPE 36 in  ","FT","S"]
[null,"S",603.65042000000005,"PVC LINER PIPE 42 in  ","FT","S"]
[null,"S",603.65048000000002,"PVC LINER PIPE 48 in  ","FT","S"]
[null,"S",603.65053999999998,"PVC LINER PIPE 54 in  ","FT","S"]
[null,"S",603.65060000000005,"PVC LINER PIPE 60 in  ","FT","S"]
[null,"S",603.65071999999998,"PVC LINER PIPE 72 in  ","FT","S"]
[null,"S",603.66017999999997,"HDPE LINER PIPE 18 in","FT","S"]
[null,"S",603.66024000000004,"HDPE LINER PIPE 24 in","FT","S"]
[null,"S",603.66030000000001,"HDPE LINER PIPE 30 in","FT","S"]
[null,"S",603.66031999999996,"HDPE LINER PIPE 32 in","FT","S"]
[null,"S",603.66035999999997,"HDPE LINER PIPE 36 in","FT","S"]
[null,"S",603.66042000000004,"HDPE LINER PIPE 42 in","FT","S"]
[null,"S",603.66048000000001,"HDPE LINER PIPE 48 in","FT","S"]
[null,"S",603.66053999999997,"HDPE LINER PIPE 54 in","FT","S"]
[null,"S",603.66060000000004,"HDPE LINER PIPE 60 in","FT","S"]
[null,"S",603.66066000000001,"HDPE LINER PIPE 66 in","FT","S"]
[null,"S",603.66071999999997,"HDPE LINER PIPE72 in","FT","S"]
[null,"S",603.66078000000005,"HDPE LINER PIPE78 in","FT","S"]
[null,"S",603.66084000000001,"HDPE LINER PIPE 84 in","FT","S"]
[null,null,603.70010000000002,"RELAYING PIPE ","FT",""]
[null,null,603.70011999999997,"RELAYING PIPE 12 in  ","FT",""]
[null,null,603.70015000000001,"RELAYING PIPE 15 in  ","FT",""]
[null,null,603.70018000000005,"RELAYING PIPE 18 in  ","FT",""]
[null,null,603.70024000000001,"RELAYING PIPE 24 in  ","FT",""]
[null,null,603.70029999999997,"RELAYING PIPE 30 in   ","FT",""]
[null,null,603.70036000000005,"RELAYING PIPE 36 in  ","FT",""]
[null,null,603.70042000000001,"RELAYING PIPE 42 in  ","FT",""]
[null,null,603.70047999999997,"RELAYING PIPE 48 in  ","FT",""]
[null,null,603.70054000000005,"RELAYING PIPE 54 in  ","FT",""]
[null,null,603.70060000000001,"RELAYING PIPE 60 in  ","FT",""]
[null,null,603.70065999999997,"RELAYING PIPE 66 in  ","FT",""]
[null,null,603.70072000000005,"RELAYING PIPE 72 in  ","FT",""]
[null,null,603.70078000000001,"RELAYING PIPE 78 in  ","FT",""]
[null,null,603.70083999999997,"RELAYING PIPE 84 in  ","FT",""]
[null,null,603.70090000000005,"RELAYING PIPE 90 in  ","FT",""]
[null,null,603.70096000000001,"RELAYING PIPE 96 in  ","FT",""]
[null,null,603.70101999999997,"RELAYING PIPE 102 in ","FT",""]
[null,null,603.70108000000005,"RELAYING PIPE 108 in  ","FT",""]
[null,null,603.70114000000001,"RELAYING PIPE 114 in  ","FT",""]
[null,null,603.70119999999997,"RELAYING PIPE 120 in  ","FT",""]
[null,null,603.71010000000001,"PIPE COLLARS","CY",""]
[null,"S",603.71054000000004,"JACKED PIPE","FT","S"]
[null,null,605.09,"GRAVEL FOR DRAINS","CY",{"$f":"IF(ISBLANK(B962),\"\",B962)","v":""}]
[null,null,605.09010000000001,"GRAVEL FOR DRAINS","TON",""]
[null,null,605.10001999999997,"UNDERDRAIN PIPE (PERF)  2 in  ","FT",""]
[null,null,605.10004000000004,"UNDERDRAIN PIPE (PERF)  4 in  ","FT",""]
[null,null,605.10005999999998,"UNDERDRAIN PIPE (PERF)  6 in  ","FT",""]
[null,null,605.10008000000005,"UNDERDRAIN PIPE (PERF)  8 in  ","FT",""]
[null,null,605.1001,"UNDERDRAIN PIPE (PERF) 10 in  ","FT",""]
[null,null,605.10011999999995,"UNDERDRAIN PIPE (PERF) 12 in  ","FT",""]
[null,null,605.10014999999999,"UNDERDRAIN PIPE (PERF) 15 in  ","FT",""]
[null,null,605.10018000000002,"UNDERDRAIN PIPE (PERF) 18 in  ","FT",""]
[null,null,605.20001999999999,"UNDERDRAIN PIPE (NON-PERF) 2 in  ","FT",""]
[null,null,605.20003999999994,"UNDERDRAIN PIPE (NON-PERF) 4 in  ","FT",""]
[null,null,605.20006000000001,"UNDERDRAIN PIPE (NON-PERF) 6 in  ","FT",""]
[null,null,605.20007999999996,"UNDERDRAIN PIPE (NON-PERF) 8 in  ","FT",""]
[null,null,605.20010000000002,"UNDERDRAIN PIPE (NON-PERF) 10 in  ","FT",""]
[null,null,605.20011999999997,"UNDERDRAIN PIPE (NON-PERF) 12 in  ","FT",""]
[null,null,605.20015000000001,"UNDERDRAIN PIPE (NON-PERF) 15 in  ","FT",""]
[null,null,605.20018000000005,"UNDERDRAIN PIPE (NON-PERF) 18 in  ","FT",""]
[null,null,605.20024000000001,"UNDERDRAIN PIPE (NON-PERF) 24 in  ","FT",""]
[null,null,605.20029999999997,"UNDERDRAIN PIPE (NON-PERF) 30 in  ","FT",""]
[null,null,605.20036000000005,"UNDERDRAIN PIPE (NON-PERF) 36 in  ","FT",""]
[null,"S",605.29999999999995,"PREFABRICATED SHEET DRAIN","SF","S"]
[null,"S",605.5,"EDGE DRAIN TYPE W","FT","S"]
[null,"S",605.50009999999997,"EDGE DRAIN TYPE X","FT","S"]
[null,"S",605.50019999999995,"HORIZONTAL DRAINS","FT","S"]
[null,null,606.01,"CORR BEAM GUARDRAIL","FT",""]
[null,null,606.01000999999997,"CORR BEAM MED BARRIER","FT",""]
[null,"S",606.01002000000005,"THRIE BEAM MED BARRIER","FT","S"]
[null,"S",606.01009999999997,"CORR BEAM GUARDRAIL SPECIAL","FT","S"]
[null,null,606.01014999999995,"CORR BEAM MED BARRIER TERM","EA",""]
[null,"S",606.01016000000004,"THRIE BEAM MED BARRIER TERM","EA","S"]
[null,"S",606.01020000000005,"MGS GUARDRAIL","FT","S"]
[null,"S",606.01025000000004,"MGS GUARDRAIL SPECIAL","FT","S"]
[null,"S",606.01030000000003,"MGS GUARDRAIL (WEATHERING STEEL)","FT","S"]
[null,"S",606.01035000000002,"MGS MEDIAN BARRIER","FT","S"]
[null,null,606.0104,"RESET MGS GUARDRAIL","FT",""]
[null,null,606.02,"CORR BEAM GUARDRAIL (SELF-OXIDIZING)","FT",""]
[null,null,606.02020000000005,"CORR BEAM GUARDRAIL END ANCH TYPE A","EA",""]
[null,null,606.02025000000003,"CORR BEAM GUARDRAIL END ANCH TYPE B","EA",""]
[null,null,606.02030000000002,"CORR BEAM GUARDRAIL END ANCH TYPE C","EA",""]
[null,null,606.02035000000001,"CORR BEAM GUARDRAIL END ANCH TYPE D","EA",""]
[null,null,606.0204,"CORR BEAM GUARDRAIL END ANCH TYPE E","EA",""]
[null,null,606.02044999999998,"CORR BEAM GUARDRAIL END ANCH TYPE F","EA",""]
[null,"S",606.02049999999997,"MGS TERMINAL TYPE I","EA","S"]
[null,"S",606.02054999999996,"MGS TERMINAL TYPE II","EA","S"]
[null,"S",606.02059999999994,"MGS TERMINAL TYPE I (WEATHERING STEEL)","EA","S"]
[null,"S",606.02065000000005,"MGS TERMINAL TYPE II (WEATHERING STEEL)","EA","S"]
[null,null,606.02070000000003,"RESET MGS GUARDRAIL TERMINAL","EA",""]
[null,null,606.03,"CORR BEAM GUARDRAIL END ANCH TYPE A (SELF-OXIDIZING)","EA",""]
[null,null,606.03004999999996,"CORR BEAM GUARDRAIL END ANCH TYPE B (SELF-OXIDIZING)","EA",""]
[null,null,606.03009999999995,"CORR BEAM GUARDRAIL END ANCH TYPE C (SELF-OXIDIZING)","EA",""]
[null,null,606.03015000000005,"CORR BEAM GUARDRAIL END ANCH TYPE D (SELF-OXIDIZING)","EA",""]
[null,null,606.03020000000004,"CORR BEAM GUARDRAIL END ANCH TYPE E (SELF-OXIDIZING)","EA",""]
[null,null,606.03025000000002,"CORR BEAM GUARDRAIL END ANCH TYPE F (SELF-OXIDIZING)","EA",""]
[null,null,606.04300000000001,"RESET CORR BEAM GUARDRAIL","FT",""]
[null,null,606.04304999999999,"UPGRADE CORR BEAM GUARDRAIL","FT",""]
[null,null,606.04309999999998,"UPGRADE CORR BEAM MED BARRIER","FT",""]
[null,null,606.04314999999997,"RESET CORR BEAM MED BARRIER","FT",""]
[null,null,606.04999999999995,"BOX BEAM GUARDRAIL","FT",""]
[null,"S",606.05005000000006,"BOX BEAM GUARDRAIL (SELF-OXIDIZING)","FT","S"]
[null,null,606.05010000000004,"BOX BEAM GUARDRAIL END ANCH TYPE  I","EA",""]
[null,"S",606.05011000000002,"BOX BEAM GUARDRAIL END ANCH TYPE  I (SELF OXIDIZING)","EA","S"]
[null,null,606.05011999999999,"BOX BEAM GUARDRAIL END ANCH TYPE II","EA",""]
[null,null,606.05012999999997,"BOX BEAM END TERM (WYBET)","EA",""]
[null,null,606.05014000000006,"BOX BEAM END TERM (WYBET) MOD","EA",{"$f":"IF(ISBLANK(B1026),\"\",B1026)","v":""}]
[null,"S",606.05015000000003,"BOX BEAM END TERM (WYBET SELF-OXIDIZING)","EA","S"]
[null,null,606.05600000000004,"RESET BOX BEAM GUARDRAIL","FT",""]
[null,null,606.05999999999995,"BOX BEAM MED BARRIER","FT",""]
[null,null,606.06010000000003,"BOX BEAM MED BARRIER END ANCH TYPE  I","EA",""]
[null,null,606.06011999999998,"BOX BEAM MED BARRIER END ANCH TYPE II","EA",""]
[null,null,606.06012999999996,"BOX BEAM MED BARRIER END TERM (WYBET)","EA",""]
[null,null,606.06500000000005,"RESET BOX BEAM MED BARRIER","FT",""]
[null,null,606.06700000000001,"UPGRADE BOX BEAM GUARDRAIL","FT",""]
[null,null,606.06709999999998,"UPGRADE BOX BEAM MED BARRIER","FT",""]
[null,null,606.06714999999997,"RESET BOX BEAM END TERM (WYBET)","EA",""]
[null,null,606.06719999999996,"TEMPORARY GUARDRAIL","EA",""]
[null,"SD",606.06724999999994,"CABLE MEDIAN BARRIER","FT","SD"]
[null,"SD",606.06730000000005,"CABLE MEDIAN BARRIER GATING TERMINAL","EA","SD"]
[null,"S",606.06735000000003,"RESET CABLE MEDIAN BARRIER","FT","S"]
[null,"S",607.10104999999999,"CONCRETE (SPECIAL)","CY","S"]
[null,null,607.10500000000002,"FENCE TYPE T","FT",""]
[null,null,607.10599999999999,"FENCE TYPE U","FT",""]
[null,null,607.10699999999997,"FENCE TYPE V","FT",""]
[null,null,607.10900000000004,"FENCE TYPE W","FT",""]
[null,null,607.10910000000001,"FENCE TYPE X","FT",""]
[null,null,607.10919999999999,"FENCE TYPE Y","FT",""]
[null,null,607.10929999999996,"FENCE TYPE Z","FT",""]
[null,null,607.20100000000002,"FENCE TYPE A (WOOD POSTS)","FT",""]
[null,null,607.202,"FENCE TYPE B (WOOD POSTS)","FT",""]
[null,null,607.20299999999997,"FENCE TYPE C (WOOD POSTS)","FT",""]
[null,null,607.20399999999995,"FENCE TYPE D (WOOD POSTS)","FT",""]
[null,null,607.20500000000004,"FENCE TYPE E (WOOD POSTS)","FT",""]
[null,null,607.20600000000002,"FENCE TYPE F (WOOD POSTS)","FT",""]
[null,null,607.20699999999999,"FENCE TYPE G (WOOD POSTS)","FT",""]
[null,null,607.20799999999997,"FENCE TYPE H (WOOD POSTS)","FT",""]
[null,null,607.30100000000004,"FENCE TYPE A (METAL POSTS)","FT",""]
[null,null,607.30200000000002,"FENCE TYPE B (METAL POSTS)","FT",""]
[null,null,607.303,"FENCE TYPE C (METAL POSTS)","FT",""]
[null,null,607.30399999999997,"FENCE TYPE D (METAL POSTS)","FT",""]
[null,null,607.30499999999995,"FENCE TYPE E (METAL POSTS)","FT",""]
[null,null,607.30600000000004,"FENCE TYPE F (METAL POSTS)","FT",""]
[null,null,607.30700000000002,"FENCE TYPE G (METAL POSTS)","FT",""]
[null,null,607.30799999999999,"FENCE TYPE H (METAL POSTS)","FT",""]
[null,null,607.40099999999995,"FENCE INDUSTRIAL 42 in","FT",""]
[null,null,607.40200000000004,"FENCE INDUSTRIAL 48 in","FT",""]
[null,null,607.40300000000002,"FENCE INDUSTRIAL 60 in","FT",""]
[null,null,607.404,"FENCE INDUSTRIAL 72 in","FT",""]
[null,null,607.40499999999997,"FENCE INDUSTRIAL 84 in","FT",""]
[null,null,607.40599999999995,"FENCE INDUSTRIAL 96 in","FT",""]
[null,null,607.40700000000004,"FENCE INDUSTRIAL 72 in (BW TOP) ","FT",""]
[null,null,607.40800000000002,"FENCE INDUSTRIAL 84 in (BW TOP) ","FT",""]
[null,null,607.40809999999999,"FENCE INDUSTRIAL 96 in (BW TOP) ","FT",""]
[null,"SD",607.40899999999999,"FENCE INDUSTRIAL SPECIAL","FT","SD"]
[null,"D",607.50099999999998,"FENCE DEER","FT","D"]
[null,"D",607.50199999999995,"FENCE BUCK AND POLE","FT","D"]
[null,"D",607.50210000000004,"FENCE CEDAR","FT","D"]
[null,null,607.50400000000002,"FENCE BARRIER","FT",""]
[null,"S",607.50599999999997,"FENCE REPAIR","FT","S"]
[null,null,607.50900000000001,"FENCE-WING (WOOD POSTS)","FT",""]
[null,null,607.51,"FENCE-WING (METAL POSTS)","FT",""]
[null,null,607.51099999999997,"FENCE TEMPORARY","FT",""]
[null,null,607.51199999999994,"RESET FENCE","FT",""]
[null,"SD",607.51504999999997,"FENCE (CONCRETE BLOCK NOISE BARRIER)","SY","SD"]
[null,"S",607.51509999999996,"FENCE POST","EA","S"]
[null,null,607.601,"GATES INDUSTRIAL- SINGLE SWING 4 ft ","EA",""]
[null,null,607.60199999999998,"GATES INDUSTRIAL- SINGLE SWING 6 ft ","EA",""]
[null,null,607.60299999999995,"GATES INDUSTRIAL- SINGLE SWING 8 ft ","EA",""]
[null,null,607.60400000000004,"GATES INDUSTRIAL- SINGLE SWING 10 ft ","EA",""]
[null,null,607.60500000000002,"GATES INDUSTRIAL- SINGLE SWING 12 ft ","EA",{"$f":"IF(ISBLANK(B1090),\"\",B1090)","v":""}]
[null,null,607.60599999999999,"GATES INDUSTRIAL- SINGLE SWING 14 ft ","EA",""]
[null,null,607.60699999999997,"GATES INDUSTRIAL- SINGLE SWING 16 ft ","EA",""]
[null,null,607.60799999999995,"GATES INDUSTRIAL- SINGLE SWING 20 ft ","EA",""]
[null,null,607.60900000000004,"GATES INDUSTRIAL- OVERHEAD SLIDE 12 ft ","EA",""]
[null,null,607.61,"GATES INDUSTRIAL- OVERHEAD SLIDE 16 ft ","EA",""]
[null,null,607.61099999999999,"GATES INDUSTRIAL- OVERHEAD SLIDE 20 ft ","EA",""]
[null,null,607.61199999999997,"GATES INDUSTRIAL- OVERHEAD SLIDE 24 ft ","EA",""]
[null,null,607.61300000000006,"GATES INDUSTRIAL- OVERHEAD SLIDE 30 ft ","EA",""]
[null,null,607.61301000000003,"GATES INDUSTRIAL-ROLLING 4 ft ","EA",""]
[null,null,607.61400000000003,"GATES INDUSTRIAL-ROLLING 12 ft ","EA",""]
[null,null,607.61500000000001,"GATES INDUSTRIAL-ROLLING 14 ft ","EA",""]
[null,null,607.61599999999999,"GATES INDUSTRIAL-ROLLING 16 ft","EA",""]
[null,null,607.61699999999996,"GATES INDUSTRIAL-ROLLING 20 ft ","EA",""]
[null,null,607.61800000000005,"GATES INDUSTRIAL-ROLLING 25 ft ","EA",""]
[null,null,607.70000000000005,"RESET GATES","EA",""]
[null,null,607.70100000000002,"GATES GALV STL 4 ft  ","EA",""]
[null,null,607.702,"GATES GALV STL 6 ft ","EA",""]
[null,null,607.70299999999997,"GATES GALV STL 8 ft ","EA",""]
[null,null,607.70399999999995,"GATES GALV STL 10 ft ","EA",""]
[null,null,607.70500000000004,"GATES GALV STL 12 ft ","EA",""]
[null,null,607.70600000000002,"GATES GALV STL 14 ft ","EA",""]
[null,null,607.70699999999999,"GATES GALV STL 16 ft ","EA",""]
[null,null,607.70708999999999,"GATES RAIL 4 ft ","EA",""]
[null,null,607.70799999999997,"GATES RAIL 6 ft ","EA",""]
[null,null,607.70899999999995,"GATES RAIL 8 ft ","EA",""]
[null,null,607.71,"GATES RAIL 10 ft ","EA",""]
[null,null,607.71100000000001,"GATES RAIL 12 ft ","EA",""]
[null,null,607.71199999999999,"GATES RAIL 14 ft ","EA",""]
[null,null,607.71299999999997,"GATES RAIL 16 ft ","EA",""]
[null,null,607.71400000000006,"GATES RAIL 18 ft","EA",""]
[null,null,607.71500000000003,"GATES RAIL 20 ft","EA",""]
[null,"SD",607.72,"GATES DEER","EA","SD"]
[null,"SD",607.721,"GATES SPECIAL","EA","SD"]
[null,"SD",607.72199999999998,"DEER RAMPS","EA","SD"]
[null,null,607.80100000000004,"BRACE PANELS","EA",""]
[null,null,607.80399999999997,"BRACE PANELS (INDUSTRIAL)","EA",""]
[null,"SD",607.80499999999995,"BRACE PANELS (DEER)","EA","SD"]
[null,"SD",607.80600000000004,"BRACE PANELS (SPECIAL)","EA","SD"]
[null,null,607.80700000000002,"BRACE PANELS (TEMPORARY)           DO NOT USE","EA",""]
[null,null,607.90099999999995,"END PANELS","EA",""]
[null,null,607.904,"END PANELS (INDUSTRIAL)","EA",""]
[null,"SD",607.90499999999997,"END PANELS (DEER)","EA","SD"]
[null,"SD",607.90599999999995,"END PANELS (SPECIAL)","EA","SD"]
[null,null,607.90700000000004,"END PANELS (TEMPORARY)               DO NOT USE","EA",""]
[null,null,608.101,"CONCRETE","SY",""]
[null,null,608.10104999999999,"CONCRETE","SF",""]
[null,null,608.10199999999998,"SIDEWALK (CONC)","SY",""]
[null,null,608.10203000000001,"SIDEWALK (CONC)","SF",""]
[null,"SD",608.10204999999996,"SIDEWALK SPECIAL (CONC)","SY","SD"]
[null,"SD",608.10208,"SIDEWALK SPECIAL (CONC)","SF","SD"]
[null,"S",608.10209999999995,"SIDEWALK DETECTABLE WARNING DEVICE","SF","S"]
[null,null,608.10299999999995,"BIKE PATH (CONC)","SY",""]
[null,null,608.10305000000005,"BIKE PATH (CONC)","SF",""]
[null,null,608.10400000000004,"MEDIAN PAVING (CONC)","SY",""]
[null,null,608.10405000000003,"MEDIAN PAVING (CONC)","SF",""]
[null,null,608.10500000000002,"DITCH PAVING (CONC) ","SY",""]
[null,null,608.10505000000001,"DITCH PAVING (CONC) ","SF",""]
[null,"S",608.10699999999997,"DECORATIVE CONCRETE","SY","S"]
[null,"S",608.10704999999996,"DECORATIVE CONCRETE","SF","S"]
[null,"D",609.10109999999997,"SPECIAL CURB TYPE D","FT","D"]
[null,"D",609.10119999999995,"SPECIAL CURB TYPE X","FT","D"]
[null,null,609.10199999999998,"CURB AND GUTTER TYPE A","FT",""]
[null,null,609.10299999999995,"CURB AND GUTTER TYPE B","FT",""]
[null,null,609.10400000000004,"CURB AND GUTTER TYPE C","FT",{"$f":"IF(ISBLANK(B1154),\"\",B1154)","v":""}]
[null,null,609.10699999999997,"DOUBLE GUTTER","SY",""]
[null,null,609.10709999999995,"DOUBLE GUTTER","SF",""]
[null,null,610.101,"METAL DRAIN INLET","EA",""]
[null,null,610.10199999999998,"METAL DRAIN PIPE","FT",""]
[null,null,611.101,"HIGHWAY MONUMENTS","EA",""]
[null,null,612.00008000000003,"WELDED STL SIPHON PIPE  8 in ","FT",""]
[null,null,612.00009999999997,"WELDED STL SIPHON PIPE 10 in ","FT",""]
[null,null,612.00012000000004,"WELDED STL SIPHON PIPE 12 in ","FT",""]
[null,null,612.00018,"WELDED STL SIPHON PIPE 18 in ","FT",""]
[null,null,612.00023999999996,"WELDED STL SIPHON PIPE 24 in ","FT",""]
[null,null,612.00030000000004,"WELDED STL SIPHON PIPE 30 in ","FT",""]
[null,null,612.00036,"WELDED STL SIPHON PIPE 36 in ","FT",""]
[null,null,612.00041999999996,"WELDED STL SIPHON PIPE 42 in ","FT",""]
[null,null,612.00048000000004,"WELDED STL SIPHON PIPE 48 in ","FT",""]
[null,null,612.00059999999996,"WELDED STL SIPHON PIPE 60 in ","FT",""]
[null,null,612.00117999999998,"CORR STL SIPHON PIPE 18 in ","FT",""]
[null,null,612.00124000000005,"CORR STL SIPHON PIPE 24 in ","FT",""]
[null,null,612.00215000000003,"CORR STL SIPHON FE SECT 15 in ","EA",""]
[null,null,612.00217999999995,"CORR STL SIPHON FE SECT 18 in ","EA",""]
[null,null,612.00224000000003,"CORR STL SIPHON FE SECT 24 in ","EA",""]
[null,null,612.00311999999997,"PLASTIC SIPHON PIPE 12 in ","FT",""]
[null,null,612.00315000000001,"PLASTIC SIPHON PIPE 15 in ","FT",""]
[null,null,612.00318000000004,"PLASTIC SIPHON PIPE 18 in ","FT",""]
[null,null,612.00324000000001,"PLASTIC SIPHON PIPE 24 in ","FT",""]
[null,null,612.00329999999997,"PLASTIC SIPHON PIPE 30 in ","FT",""]
[null,null,612.00414999999998,"RCP SIPHON 15 in","FT",""]
[null,null,612.00418000000002,"RCP SIPHON 18 in","FT",""]
[null,null,612.00423999999998,"RCP SIPHON 24 in","FT",""]
[null,null,612.00429999999994,"RCP SIPHON 30 in","FT",""]
[null,null,612.00436000000002,"RCP SIPHON 36 in","FT",""]
[null,null,612.00441999999998,"RCP SIPHON 42 in","FT",""]
[null,null,612.00465999999994,"RCP SIPHON 66 in","FT",""]
[null,null,612.00514999999996,"RCP SIPHON FE SECT 15 in","EA",""]
[null,null,612.00518,"RCP SIPHON FE SECT 18 in","EA",""]
[null,null,612.00523999999996,"RCP SIPHON FE SECT 24 in","EA",""]
[null,null,612.00530000000003,"RCP SIPHON FE SECT 30 in","EA",""]
[null,null,612.00536,"RCP SIPHON FE SECT 36 in","EA",""]
[null,"S",612.10011999999995,"CORR STL ARCH CULVERT 12 ft ","FT","S"]
[null,null,613.01,"LTX EMULSION PAINT (CONC)","LS",""]
[null,null,614.01,"EROSION CONTROL CONCRETE","CY",""]
[null,null,615.01012000000003,"CATTLE GUARD (HEAVY DUTY) 12 ft ","EA",""]
[null,null,615.01017999999999,"CATTLE GUARD (HEAVY DUTY) 18 ft ","EA",""]
[null,null,615.01023999999995,"CATTLE GUARD (HEAVY DUTY) 24 ft ","EA",""]
[null,null,615.01030000000003,"CATTLE GUARD (HEAVY DUTY) 30 ft ","EA",""]
[null,null,615.01035999999999,"CATTLE GUARD (HEAVY DUTY) 36 ft ","EA",""]
[null,null,615.01041999999995,"CATTLE GUARD (HEAVY DUTY) 42 ft ","EA",""]
[null,null,615.01048000000003,"CATTLE GUARD (HEAVY DUTY) 48 ft ","EA",""]
[null,null,615.01059999999995,"CATTLE GUARD (HEAVY DUTY) 60 ft ","EA",""]
[null,null,615.02012000000002,"CATTLE GUARD (MEDIUM DUTY) 12 ft ","EA",""]
[null,null,615.02017999999998,"CATTLE GUARD (MEDIUM DUTY) 18 ft ","EA",""]
[null,null,615.02023999999994,"CATTLE GUARD (MEDIUM DUTY) 24 ft ","EA",""]
[null,null,615.02030000000002,"CATTLE GUARD (MEDIUM DUTY) 30 ft ","EA",""]
[null,null,615.02035999999998,"CATTLE GUARD (MEDIUM DUTY) 36 ft ","EA",""]
[null,null,615.02041999999994,"CATTLE GUARD (MEDIUM DUTY) 42 ft ","EA",""]
[null,null,615.06011999999998,"RESET CATTLE GUARD (HEAVY DUTY) 12 ft ","EA",""]
[null,null,615.06017999999995,"RESET CATTLE GUARD (HEAVY DUTY) 18 ft ","EA",""]
[null,null,615.06024000000002,"RESET CATTLE GUARD (HEAVY DUTY) 24 ft ","EA",""]
[null,null,615.06029999999998,"RESET CATTLE GUARD (HEAVY DUTY) 30 ft ","EA",""]
[null,null,615.06035999999995,"RESET CATTLE GUARD (HEAVY DUTY) 36 ft ","EA",""]
[null,null,615.06042000000002,"RESET CATTLE GUARD (HEAVY DUTY) 42 ft ","EA",""]
[null,null,615.06136000000004,"REPLACE CATTLE GUARD GRILL (HEAVY DUTY) 36 ft ","EA",""]
[null,null,615.07011999999997,"RESET CATTLE GUARD (MEDIUM DUTY) 12 ft ","EA",""]
[null,null,615.07018000000005,"RESET CATTLE GUARD (MEDIUM DUTY) 18 ft ","EA",""]
[null,null,615.07024000000001,"RESET CATTLE GUARD (MEDIUM DUTY) 24 ft ","EA",{"$f":"IF(ISBLANK(B1218),\"\",B1218)","v":""}]
[null,null,615.07029999999997,"RESET CATTLE GUARD (MEDIUM DUTY) 30 ft ","EA",""]
[null,null,615.07036000000005,"RESET CATTLE GUARD (MEDIUM DUTY) 36 ft ","EA",""]
[null,null,615.07042000000001,"RESET CATTLE GUARD (MEDIUM DUTY) 42 ft ","EA",""]
[null,null,615.07050000000004,"RESET CATTLE GUARD","EA",""]
[null,"SD",615.07060000000001,"CATTLE GUARD SPECIAL","EA","SD"]
[null,null,615.08000000000004,"CATTLE GUARD SWING-WING","EA",""]
[null,null,615.08005000000003,"REPLACE CATTLE GUARD GRILL UNIT (MEDIUM DUTY) 24 ft ","EA",""]
[null,"S",615.08010000000002,"ADJUST CATTLE GUARD","EA","S"]
[null,null,616.09,"RESET SNOW FENCE","EA",""]
[null,"D",616.09005999999999,"SNOW FENCE (WOOD) 6 ft ","EA","D"]
[null,"D",616.09007999999994,"SNOW FENCE (WOOD) 8 ft ","EA","D"]
[null,null,616.09010000000001,"SNOW FENCE (WOOD) 10 ft ","EA",""]
[null,null,616.09011999999996,"SNOW FENCE (WOOD) 12 ft ","EA",""]
[null,null,616.09019999999998,"SNOW FENCE REPAIR","$$",""]
[null,"SD",616.09029999999996,"SNOW FENCE WOOD LATH 4 ft","FT","SD"]
[null,"SD",616.09105999999997,"SNOW FENCE (EMBEDDED POSTS) 6 ft","FT","SD"]
[null,"SD",616.09108000000003,"SNOW FENCE (EMBEDDED POSTS) 8 ft","FT","SD"]
[null,"SD",616.09109999999998,"SNOW FENCE (EMBEDDED POSTS) 10 ft","FT","SD"]
[null,"SD",616.09112000000005,"SNOW FENCE (EMBEDDED POSTS) 12 ft","FT","SD"]
[null,null,617.01,"CUT-OFF WALL (CONC)","CY",""]
[null,null,617.01009999999997,"HEADWALL (CONC)","CY",""]
[null,null,618.10405000000003,"RC STOCK PASS 48 X 60 in ","FT",""]
[null,null,618.10406,"RC STOCK PASS 48 X 72 in ","FT",""]
[null,null,618.10506999999996,"RC STOCK PASS 60 X 84 in ","FT",""]
[null,null,618.10707000000002,"RC STOCK PASS 91 X 91 in ","FT",""]
[null,null,618.20405000000005,"RC STOCK PASS FE SECT 48 X 60 in ","EA",""]
[null,null,618.20406000000003,"RC STOCK PASS FE SECT 48 X 72 in ","EA",""]
[null,null,618.20506999999998,"RC STOCK PASS FE SECT 60 X 84 in ","EA",""]
[null,null,618.20707000000004,"RC STOCK PASS FE SECT 91 X 91 in","EA",""]
[null,null,619.01017999999999,"TRASH GUARD 18 in ","EA",""]
[null,null,619.01023999999995,"TRASH GUARD 24 in ","EA",""]
[null,null,619.01030000000003,"TRASH GUARD 30 in ","EA",""]
[null,null,619.01035999999999,"TRASH GUARD 36 in ","EA",""]
[null,null,619.01041999999995,"TRASH GUARD 42 in ","EA",""]
[null,null,619.01048000000003,"TRASH GUARD 48 in ","EA",""]
[null,null,619.01053999999999,"TRASH GUARD 54 in ","EA",""]
[null,null,619.01059999999995,"TRASH GUARD 60 in ","EA",""]
[null,null,619.01066000000003,"TRASH GUARD 66 in ","EA",""]
[null,null,619.02017999999998,"TRASH GUARD CMP 18 in ","EA",""]
[null,null,619.02023999999994,"TRASH GUARD CMP 24 in ","EA",""]
[null,null,619.02030000000002,"TRASH GUARD CMP 30 in ","EA",""]
[null,null,619.02035999999998,"TRASH GUARD CMP 36 in ","EA",""]
[null,null,619.02041999999994,"TRASH GUARD CMP 42 in ","EA",""]
[null,null,619.02048000000002,"TRASH GUARD CMP 48 in ","EA",""]
[null,null,619.02077999999995,"TRASH GUARD CMP 78 in ","EA",""]
[null,null,619.03017999999997,"TRASH GUARD 18 in EQUIV CMP ARCH ","EA",""]
[null,null,619.03024000000005,"TRASH GUARD 24 in EQUIV CMP ARCH ","EA",""]
[null,null,619.03030000000001,"TRASH GUARD 30 in EQUIV CMP ARCH ","EA",""]
[null,null,619.03035999999997,"TRASH GUARD 36 in EQUIV CMP ARCH ","EA",""]
[null,null,619.03042000000005,"TRASH GUARD 42 in EQUIV CMP ARCH ","EA",""]
[null,null,619.03048000000001,"TRASH GUARD 48 in EQUIV CMP ARCH ","EA",""]
[null,null,619.04017999999996,"TRASH GUARD RCP 18 in ","EA",""]
[null,null,619.04024000000004,"TRASH GUARD RCP 24 in ","EA",""]
[null,null,619.0403,"TRASH GUARD RCP 30 in ","EA",""]
[null,null,619.04035999999996,"TRASH GUARD RCP 36 in ","EA",""]
[null,null,619.04042000000004,"TRASH GUARD RCP 42 in ","EA",""]
[null,null,619.04048,"TRASH GUARD RCP 48 in ","EA",""]
[null,null,619.04053999999996,"TRASH GUARD RCP 54 in ","EA",""]
[null,null,619.04060000000004,"TRASH GUARD RCP 60 in ","EA",""]
[null,null,619.04066,"TRASH GUARD RCP 66 in ","EA",""]
[null,null,619.04078000000004,"TRASH GUARD RCP 78 in ","EA",""]
[null,null,619.05024000000003,"TRASH GUARD 24 in EQUIV RCP ARCH ","EA",""]
[null,null,619.05029999999999,"TRASH GUARD 30 in EQUIV RCP ARCH ","EA",""]
[null,null,619.05035999999996,"TRASH GUARD 36 in EQUIV RCP ARCH ","EA",{"$f":"IF(ISBLANK(B1282),\"\",B1282)","v":""}]
[null,null,619.05042000000003,"TRASH GUARD 42 in EQUIV RCP ARCH ","EA",""]
[null,null,619.05047999999999,"TRASH GUARD 48 in EQUIV RCP ARCH ","EA",""]
[null,null,619.06024000000002,"TRASH GUARD 24 in EQUIV RCP ELLIPTICAL ","EA",""]
[null,null,619.06029999999998,"TRASH GUARD 30 in EQUIV RCP ELLIPTICAL ","EA",""]
[null,null,619.06035999999995,"TRASH GUARD 36 in EQUIV RCP ELLIPTICAL ","EA",""]
[null,null,619.06042000000002,"TRASH GUARD 42 in EQUIV RCP ELLIPTICAL ","EA",""]
[null,null,619.06047999999998,"TRASH GUARD 48 in EQUIV RCP ELLIPTICAL ","EA",""]
[null,null,619.06053999999995,"TRASH GUARD 54 in EQUIV RCP ELLIPTICAL ","EA",""]
[null,null,620.06002999999998,"VALVE BOXES  3 in ","EA",""]
[null,null,620.06003999999996,"VALVE BOXES  4 in ","EA",""]
[null,null,620.06006000000002,"VALVE BOXES  6 in ","EA",""]
[null,null,620.06007999999997,"VALVE BOXES  8 in ","EA",""]
[null,null,620.06010000000003,"VALVE BOXES 10 in ","EA",""]
[null,null,620.06011999999998,"VALVE BOXES 12 in ","EA",""]
[null,null,620.06014000000005,"VALVE BOXES 14 in ","EA",""]
[null,null,620.07000000000005,"ADJUSTMENTS, FIRE HYDRANTS  ","EA",""]
[null,null,620.07010000000002,"ADJUSTMENTS, VALVE BOXES ","EA",""]
[null,"SD",620.07029999999997,"WATER SYSTEMS","LS","SD"]
[null,null,620.07095000000004,"FIRE HYDRANT","EA",""]
[null,null,620.08000000000004,"THRUST BLOCKS","EA",""]
[null,"S",621.02121,"WASTE WATER SYSTEM","LS","S"]
[null,null,622.10059999999999,"STRUCTURAL PLATE PIPE  60 in ","FT",""]
[null,null,622.10065999999995,"STRUCTURAL PLATE PIPE  66 in ","FT",""]
[null,null,622.10072000000002,"STRUCTURAL PLATE PIPE  72 in ","FT",""]
[null,null,622.10077999999999,"STRUCTURAL PLATE PIPE  78 in ","FT",""]
[null,null,622.10083999999995,"STRUCTURAL PLATE PIPE  84 in ","FT",""]
[null,null,622.10090000000002,"STRUCTURAL PLATE PIPE  90 in ","FT",""]
[null,null,622.10095999999999,"STRUCTURAL PLATE PIPE  96 in","FT",""]
[null,null,622.10101999999995,"STRUCTURAL PLATE PIPE 102 in ","FT",""]
[null,null,622.10108000000002,"STRUCTURAL PLATE PIPE 108 in ","FT",""]
[null,null,622.10113999999999,"STRUCTURAL PLATE PIPE 114 in ","FT",""]
[null,null,622.10119999999995,"STRUCTURAL PLATE PIPE 120 in ","FT",""]
[null,null,622.10126000000002,"STRUCTURAL PLATE PIPE 126 in ","FT",""]
[null,null,622.10131999999999,"STRUCTURAL PLATE PIPE 132 in ","FT",""]
[null,null,622.10137999999995,"STRUCTURAL PLATE PIPE 138 in ","FT",""]
[null,null,622.10144000000003,"STRUCTURAL PLATE PIPE 144 in ","FT",""]
[null,null,622.10149999999999,"STRUCTURAL PLATE PIPE 150 in ","FT",""]
[null,null,622.10155999999995,"STRUCTURAL PLATE PIPE 156 in ","FT",""]
[null,null,622.10162000000003,"STRUCTURAL PLATE PIPE 162 in ","FT",""]
[null,null,622.10167999999999,"STRUCTURAL PLATE PIPE 168 in ","FT",""]
[null,null,622.10173999999995,"STRUCTURAL PLATE PIPE 174 in ","FT",""]
[null,null,622.10180000000003,"STRUCTURAL PLATE PIPE 180 in ","FT",""]
[null,null,622.20069999999998,"STRUCTURAL PLATE PIPE-ARCH 70 X 78 in ","FT",""]
[null,null,622.20073000000002,"STRUCTURAL PLATE PIPE-ARCH73 X 55 in ","FT",""]
[null,null,622.20075999999995,"STRUCTURAL PLATE PIPE-ARCH 76 X 57 in ","FT",""]
[null,null,622.20081000000005,"STRUCTURAL PLATE PIPE-ARCH 81 X 59 in ","FT",""]
[null,null,622.20083999999997,"STRUCTURAL PLATE PIPE-ARCH 84 X 61 in ","FT",""]
[null,null,622.20087000000001,"STRUCTURAL PLATE PIPE-ARCH 87 X  63 in","FT",""]
[null,null,622.20092,"STRUCTURAL PLATE PIPE-ARCH 92 X  65 in ","FT",""]
[null,null,622.20095000000003,"STRUCTURAL PLATE PIPE-ARCH 95 X 67 in ","FT",""]
[null,null,622.20097999999996,"STRUCTURAL PLATE PIPE-ARCH 98 X 69 in ","FT",""]
[null,null,622.20102999999995,"STRUCTURAL PLATE PIPE-ARCH 103 X 71 in ","FT",""]
[null,null,622.20105999999998,"STRUCTURAL PLATE PIPE-ARCH 106 X 73 in ","FT",""]
[null,null,622.20111999999995,"STRUCTURAL PLATE PIPE-ARCH 112 X 75 in ","FT",""]
[null,null,622.20114000000001,"STRUCTURAL PLATE PIPE-ARCH 114 X 77 in ","FT",""]
[null,null,622.20117000000005,"STRUCTURAL PLATE PIPE-ARCH 117 X 79 in ","FT",""]
[null,null,622.20123000000001,"STRUCTURAL PLATE PIPE-ARCH 123 X 81 in ","FT",""]
[null,null,622.20128,"STRUCTURAL PLATE PIPE-ARCH 128 X 83 in ","FT",""]
[null,null,622.20131000000003,"STRUCTURAL PLATE PIPE-ARCH 131 X 85 in ","FT",""]
[null,null,622.20137,"STRUCTURAL PLATE PIPE-ARCH 137 X 87 in ","FT",""]
[null,null,622.20138999999995,"STRUCTURAL PLATE PIPE-ARCH 139 X 89 in ","FT",""]
[null,null,622.20141999999998,"STRUCTURAL PLATE PIPE-ARCH 142 X 91 in ","FT",""]
[null,null,622.20147999999995,"STRUCTURAL PLATE PIPE-ARCH 148 X 93 in ","FT",""]
[null,null,622.20150000000001,"STRUCTURAL PLATE PIPE-ARCH 150 X 95 in ","FT",{"$f":"IF(ISBLANK(B1346),\"\",B1346)","v":""}]
[null,null,622.20151999999996,"STRUCTURAL PLATE PIPE-ARCH 152 X 97 in ","FT",""]
[null,null,622.20154000000002,"STRUCTURAL PLATE PIPE-ARCH 154 X 100 in ","FT",""]
[null,null,622.20159000000001,"STRUCTURAL PLATE PIPE-ARCH 159 X 112 in ","FT",""]
[null,null,622.20162000000005,"STRUCTURAL PLATE PIPE-ARCH 162 X 114 in ","FT",""]
[null,null,622.20168000000001,"STRUCTURAL PLATE PIPE-ARCH 168 X 116 in ","FT",""]
[null,null,622.20169999999996,"STRUCTURAL PLATE PIPE-ARCH 170 X 118 in","FT",""]
[null,null,622.20173,"STRUCTURAL PLATE PIPE-ARCH 173 X 120 in ","FT",""]
[null,null,622.20178999999996,"STRUCTURAL PLATE PIPE-ARCH 179 X 122 in ","FT",""]
[null,null,622.20183999999995,"STRUCTURAL PLATE PIPE-ARCH 184 X 124 in ","FT",""]
[null,null,622.20186999999999,"STRUCTURAL PLATE PIPE-ARCH 187 X 126 in ","FT",""]
[null,null,622.20190000000002,"STRUCTURAL PLATE PIPE-ARCH 190 X 128 in ","FT",""]
[null,null,622.20195000000001,"STRUCTURAL PLATE PIPE-ARCH 195 X 130 in ","FT",""]
[null,null,622.20198000000005,"STRUCTURAL PLATE PIPE-ARCH 198 X 132 in ","FT",""]
[null,null,622.20199000000002,"STRUCTURAL PLATE PIPE-ARCH 199 X 121 in ","FT",""]
[null,null,622.20204000000001,"STRUCTURAL PLATE PIPE-ARCH 204 X 134 in ","FT",""]
[null,null,622.20205999999996,"STRUCTURAL PLATE PIPE-ARCH 206 X 136 in ","FT",""]
[null,null,622.20209,"STRUCTURAL PLATE PIPE-ARCH 209 X 138 in","FT",""]
[null,null,622.20214999999996,"STRUCTURAL PLATE PIPE-ARCH 215 X 140 in ","FT",""]
[null,null,622.20217000000002,"STRUCTURAL PLATE PIPE-ARCH 217 X 142 in","FT",""]
[null,null,622.20222999999999,"STRUCTURAL PLATE PIPE-ARCH 223 X 144 in ","FT",""]
[null,null,622.20225000000005,"STRUCTURAL PLATE PIPE-ARCH 225 X 146 in ","FT",""]
[null,null,622.20231000000001,"STRUCTURAL PLATE PIPE-ARCH 231 X 148 in ","FT",""]
[null,null,622.20234000000005,"STRUCTURAL PLATE PIPE-ARCH 234 X 150 in ","FT",""]
[null,null,622.20236,"STRUCTURAL PLATE PIPE-ARCH 236 X 152 in ","FT",""]
[null,null,622.20239000000004,"STRUCTURAL PLATE PIPE-ARCH 239 X 154 in ","FT",""]
[null,null,622.20245,"STRUCTURAL PLATE PIPE-ARCH 245 X 156 in ","FT",""]
[null,null,622.20246999999995,"STRUCTURAL PLATE PIPE-ARCH 247 X 158 in ","FT",""]
[null,null,622.30068000000006,"STRUCTURAL PLATE STOCK PASS 68 X 78 in ","FT",""]
[null,null,622.30070000000001,"STRUCTURAL PLATE STOCK PASS 70 X 92 in ","FT",""]
[null,null,622.30206999999996,"STRUCTURAL PLATE STOCK PASS 207 X 204 in ","FT",""]
[null,null,625.101,"MANHOLE TYPE A","EA",""]
[null,null,625.10199999999998,"MANHOLE TYPE B","EA",""]
[null,null,625.10299999999995,"MANHOLE TYPE C","EA",""]
[null,null,625.10400000000004,"MANHOLE TYPE D","EA",""]
[null,null,625.10500000000002,"MANHOLE TYPE E","EA",""]
[null,null,625.10599999999999,"MANHOLE TYPE F","EA",""]
[null,"D",625.10699999999997,"MANHOLE TYPE X","EA","D"]
[null,"D",625.10799999999995,"MANHOLE TYPE Y","EA","D"]
[null,"D",625.10900000000004,"MANHOLE TYPE Z","EA","D"]
[null,null,625.12,"MANHOLE  ADJUSTMENT","EA",""]
[null,"SD",625.12009999999998,"MANHOLE VAULT TYPE A","EA","SD"]
[null,"SD",625.12019999999995,"MANHOLE VAULT TYPE B","EA","SD"]
[null,"SD",625.12030000000004,"MANHOLE VAULT TYPE C","EA","SD"]
[null,"SD",625.12040000000002,"MANHOLE VAULT TYPE D","EA","SD"]
[null,"SD",625.12045000000001,"STORM WATER TREATMENT SYSTEM","EA","SD"]
[null,null,625.20100000000002,"INLET TYPE A","EA",""]
[null,null,625.202,"INLET TYPE B","EA",""]
[null,null,625.20299999999997,"INLET TYPE C","EA",""]
[null,null,625.20399999999995,"INLET TYPE D","EA",""]
[null,null,625.20500000000004,"INLET TYPE E","EA",""]
[null,"D",625.20501000000002,"INLET TYPE F","EA","D"]
[null,"D",625.20501999999999,"INLET TYPE T","EA","D"]
[null,"D",625.20502999999997,"INLET TYPE U","EA","D"]
[null,"D",625.20504000000005,"INLET TYPE V","EA","D"]
[null,"D",625.20505000000003,"INLET TYPE W","EA","D"]
[null,"D",625.20600000000002,"INLET TYPE X","EA","D"]
[null,"D",625.20699999999999,"INLET TYPE Y","EA","D"]
[null,"D",625.20799999999997,"INLET TYPE Z","EA","D"]
[null,"D",625.22,"INLET  ADJUSTMENT","EA","D"]
[null,null,625.30100000000004,"INLET TYPE M1","EA",""]
[null,"D",625.33000000000004,"CATCH BASIN TYPE A","EA","D"]
[null,"D",625.4,"DIVERSION BOX TYPE W","EA","D"]
[null,"D",625.40099999999995,"DIVERSION BOX TYPE X","EA","D"]
[null,"D",625.40200000000004,"DIVERSION BOX TYPE Y","EA",{"$f":"IF(ISBLANK(B1410),\"\",B1410)","v":"D"}]
[null,"D",625.40300000000002,"DIVERSION BOX TYPE Z","EA","D"]
[null,"D",625.5,"SLIDE GATE A","EA","D"]
[null,"D",625.50009999999997,"SLIDE GATE B","EA","D"]
[null,"D",625.50014999999996,"SLIDE GATE C","EA","D"]
[null,"D",625.50019999999995,"SLIDE GATE D","EA","D"]
[null,"D",625.50099999999998,"SLIDE GATE W","EA","D"]
[null,"D",625.50199999999995,"SLIDE GATE X","EA","D"]
[null,"D",625.50300000000004,"SLIDE GATE Y","EA","D"]
[null,"D",625.50400000000002,"SLIDE GATE Z","EA","D"]
[null,"SD",625.601,"FLAP GATE W","EA","SD"]
[null,"SD",625.60199999999998,"FLAP GATE X","EA","SD"]
[null,"SD",625.60299999999995,"FLAP GATE Y","EA","SD"]
[null,"SD",625.60400000000004,"FLAP GATE Z","EA","SD"]
[null,"SD",625.70100000000002,"GATE VALVE W","EA","SD"]
[null,"SD",625.702,"GATE VALVE X","EA","SD"]
[null,"SD",625.70299999999997,"GATE VALVE Y","EA","SD"]
[null,"SD",625.70399999999995,"GATE VALVE Z","EA","SD"]
[null,"SD",625.79999999999995,"PARSHALL FLUME 9 X 15 in","EA","SD"]
[null,"SD",625.80005000000006,"PARSHALL FLUME 12 X 15 in ","EA","SD"]
[null,"SD",625.80100000000004,"PARSHALL FLUME 18 X 18 in ","EA","SD"]
[null,"SD",625.80200000000002,"PARSHALL FLUME 24 X 36 in ","EA","SD"]
[null,"SD",625.803,"PARSHALL FLUME 36 X 30 in ","EA","SD"]
[null,null,627.01,"EPOXY RESIN INJECTION","LS",""]
[null,null,627.01000999999997,"EPOXY RESIN INJECTION","GAL",""]
[null,null,627.01004999999998,"EPOXY RESIN INJECTION","FT",""]
[null,"S",630.01009999999997,"POND LINER SYSTEM","SY","S"]
[null,null,631.01012000000003,"SLOTTED DRAIN 12 in ","FT",""]
[null,null,631.01014999999995,"SLOTTED DRAIN 15 in ","FT",""]
[null,null,631.01017999999999,"SLOTTED DRAIN 18 in ","FT",""]
[null,null,631.01023999999995,"SLOTTED DRAIN 24 in ","FT",""]
[null,null,631.01030000000003,"SLOTTED DRAIN 30 in ","FT",""]
[null,null,631.01035999999999,"SLOTTED DRAIN 36 in ","FT",""]
[null,"S",640.00000999999997,"SPECIAL ITEM LS-A","LS","S"]
[null,"S",640.00001999999995,"SPECIAL ITEM LS-B","LS","S"]
[null,"S",640.00003000000004,"SPECIAL ITEM LS-C","LS","S"]
[null,"S",640.00004000000001,"SPECIAL ITEM EA-A","EA","S"]
[null,"S",640.00004999999999,"SPECIAL ITEM EA-B","EA","S"]
[null,"S",640.00005999999996,"SPECIAL ITEM EA-C","EA","S"]
[null,"S",640.00007000000005,"SPECIAL ITEM FT-A","FT","S"]
[null,"S",640.00008000000003,"SPECIAL ITEM FT-B","FT","S"]
[null,"S",640.00009,"SPECIAL ITEM FT-C","FT","S"]
[null,"S",640.00009999999997,"SPECIAL ITEM CY-A","CY","S"]
[null,"S",640.00010999999995,"SPECIAL ITEM CY-B","CY","S"]
[null,"S",640.00012000000004,"SPECIAL ITEM CY-C","CY","S"]
[null,"S",640.00013000000001,"SPECIAL ITEM SY-A","SY","S"]
[null,"S",640.00013999999999,"SPECIAL ITEM SY-B","SY","S"]
[null,"S",640.00014999999996,"SPECIAL ITEM SY-C","SY","S"]
[null,"S",640.00016000000005,"SPECIAL ITEM CF-A","CF","S"]
[null,"S",640.00017000000003,"SPECIAL ITEM CF-B","CF","S"]
[null,"S",640.00018,"SPECIAL ITEM CF-C","CF","S"]
[null,"S",640.00018999999998,"SPECIAL ITEM SF-A","SF","S"]
[null,"S",640.00019999999995,"SPECIAL ITEM SF-B","SF","S"]
[null,"S",640.00021000000004,"SPECIAL ITEM SF-C","SF","S"]
[null,"S",640.00022000000001,"SPECIAL ITEM HR-A","HR","S"]
[null,"S",640.00022999999999,"SPECIAL ITEM FT-D","FT","S"]
[null,"S",640.00023999999996,"SPECIAL ITEM FT-E ","FT","S"]
[null,"S",640.00025000000005,"SPECIAL ITEM EA-D","EA","S"]
[null,"S",640.00026000000003,"SPECIAL ITEM LS-D","LS","S"]
[null,"S",640.00027,"SPECIAL ITEM EA-E","EA","S"]
[null,"S",640.00027999999998,"SPECIAL ITEM LS-E","LS","S"]
[null,"S",640.00028999999995,"SPECIAL ITEM LS-F","LS","S"]
[null,"S",640.00030000000004,"SPECIAL ITEM SY-D","SY","S"]
[null,"S",640.00031000000001,"SPECIAL ITEM SY-E","SY","S"]
[null,"S",640.00031999999999,"SPECIAL ITEM CY-D","CY",{"$f":"IF(ISBLANK(B1474),\"\",B1474)","v":"S"}]
[null,"S",640.00032999999996,"SPECIAL ITEM CY-E","CY","S"]
[null,"S",640.00034000000005,"SPECIAL ITEM TON-A","TON","S"]
[null,"S",640.00035000000003,"SPECIAL ITEM TON-B","TON","S"]
[null,"S",699.0104,"SCALE HOUSE","EA","S"]
[null,"S",699.01044999999999,"WEIGH SCALES","LS","S"]
[null,"S",699.01061000000004,"COLORING AND TEXTURING CONCRETE SURFACES","SF","S"]
[null,"S",699.01065000000006,"TIMBER ROOF SYSTEM","LS","S"]
[null,"S",699.01070000000004,"SEALING AND BACKFILLING UNDERGROUND VAULTS","LS","S"]
[null,"S",699.02003999999999,"DUCTILE IRON WATER LINE  4 in ","FT","S"]
[null,"S",699.02005999999994,"DUCTILE IRON WATER LINE  6 in ","FT","S"]
[null,"S",699.02008000000001,"DUCTILE IRON WATER LINE  8 in ","FT","S"]
[null,"S",699.02009999999996,"DUCTILE IRON WATER LINE 10 in ","FT","S"]
[null,"S",699.02012000000002,"DUCTILE IRON WATER LINE 12 in ","FT","S"]
[null,"S",699.02013999999997,"COPPER WATER LINE 3/4 in ","FT","S"]
[null,"S",699.02016000000003,"COPPER WATER LINE 1 in ","FT","S"]
[null,"S",699.02017999999998,"COPPER WATER LINE 1 1/2 in ","FT","S"]
[null,"S",699.02020000000005,"COPPER WATER LINE 2 in ","FT","S"]
[null,"S",699.02025000000003,"COPPER WATER LINE 2 1/2 in ","FT","S"]
[null,"S",699.02030000000002,"COPPER WATER LINE 3 in ","FT","S"]
[null,"S",699.0204,"COPPER WATER LINE 4 in ","FT","S"]
[null,"S",699.03000999999995,"POLYVINYL CHLORIDE PRESSURE PIPE  3/4 in ","FT","S"]
[null,"S",699.03009999999995,"POLYVINYL CHLORIDE PRESSURE PIPE  1 in ","FT","S"]
[null,"S",699.03012000000001,"POLYVINYL CHLORIDE PRESSURE PIPE  1 1/4 in ","FT","S"]
[null,"S",699.03015000000005,"POLYVINYL CHLORIDE PRESSURE PIPE  1 1/2 in ","FT","S"]
[null,"S",699.03020000000004,"POLYVINYL CHLORIDE PRESSURE PIPE  2 in ","FT","S"]
[null,"S",699.03025000000002,"POLYVINYL CHLORIDE PRESSURE PIPE  2 1/2 in ","FT","S"]
[null,"S",699.03030000000001,"POLYVINYL CHLORIDE PRESSURE PIPE  3 in ","FT","S"]
[null,"S",699.03039999999999,"POLYVINYL CHLORIDE PRESSURE PIPE  4 in ","FT","S"]
[null,"S",699.03060000000005,"POLYVINYL CHLORIDE PRESSURE PIPE  6 in ","FT","S"]
[null,"S",699.0308,"POLYVINYL CHLORIDE PRESSURE PIPE  8 in ","FT","S"]
[null,"S",699.03080999999997,"POLYVINYL CHLORIDE PRESSURE PIPE 10 in ","FT","S"]
[null,"S",699.03081999999995,"POLYVINYL CHLORIDE PRESSURE PIPE 12 in ","FT","S"]
[null,"S",699.03084000000001,"POLYVINYL CHLORIDE PRESSURE PIPE 14 in ","FT","S"]
[null,"S",699.03084999999999,"POLYVINYL CHLORIDE PRESSURE PIPE 15 in ","FT","S"]
[null,"S",699.03085999999996,"POLYVINYL CHLORIDE PRESSURE PIPE 16 in ","FT","S"]
[null,"S",699.03089999999997,"POLYVINYL CHLORIDE PRESSURE PIPE 18 in ","FT","S"]
[null,"S",699.03094999999996,"POLYVINYL CHLORIDE PRESSURE PIPE 24 in ","FT","S"]
[null,"S",699.03099999999995,"POLYVINYL CHLORIDE PRESSURE PIPE 30 in ","FT","S"]
[null,"S",699.04001000000005,"WATER VALVES  1 in ","EA","S"]
[null,"S",699.04003999999998,"WATER VALVES  4 in ","EA","S"]
[null,"S",699.04006000000004,"WATER VALVES  6 in ","EA","S"]
[null,"S",699.04007999999999,"WATER VALVES  8 in  ","EA","S"]
[null,"S",699.04010000000005,"WATER VALVES 10 in ","EA","S"]
[null,"S",699.04012,"WATER VALVES 12 in ","EA","S"]
[null,"S",699.04013999999995,"WATER VALVES 14 in ","EA","S"]
[null,"S",699.04024000000004,"WATER VALVES 24 in ","EA","S"]
[null,"S",699.05007999999998,"CAST IRON VALVE 8 in ","EA","S"]
[null,"S",699.05010000000004,"CAST IRON VALVE 10 in ","EA","S"]
[null,"S",699.05011999999999,"CAST IRON VALVE 12 in ","EA","S"]
[null,"S",699.05111999999997,"REDUCERS 12 in X 10 in ","EA","S"]
[null,"S",699.05211999999995,"CAST IRON TEE 12 in X 8 in X 12 in","EA","S"]
[null,"S",699.05312000000004,"CAST IRON TEE 12 in X 10 in X 12 in","EA","S"]
[null,"S",699.05322000000001,"CAST IRON 22.5 DEGREE BENDS 8 in ","EA","S"]
[null,"S",699.05325000000005,"CAST IRON 22.5 DEGREE BENDS 10 in ","EA","S"]
[null,"S",699.05345,"CAST IRON 45 DEGREE BENDS 10 in ","EA","S"]
[null,"S",699.05349999999999,"CAST IRON 45 DEGREE BENDS 12 in ","EA","S"]
[null,"S",699.06,"WATER AND SEWER LINES ADJUSTMENT","LS","S"]
[null,"S",699.06005000000005,"WATER LINE","FT","S"]
[null,"S",699.06010000000003,"WATER SERVICE LINE","EA","S"]
[null,"S",699.06015000000002,"WATER MAIN REPLACEMENT","LS","S"]
[null,"S",699.06020000000001,"WATER TAP REPLACEMENT","LS","S"]
[null,"S",699.06025,"CORPORATION STOPS 3/4 in ","EA","S"]
[null,"S",699.06029999999998,"CORPORATION STOPS 1 in","EA","S"]
[null,"S",699.06034999999997,"CORPORATION STOPS 1 1/2 in ","EA",{"$f":"IF(ISBLANK(B1538),\"\",B1538)","v":"S"}]
[null,"S",699.06039999999996,"CORPORATION STOPS 2 in ","EA","S"]
[null,"S",699.06050000000005,"SPRINKLER SYSTEM DISCONNECT","LS","S"]
[null,"S",699.06055000000003,"SPRINKLER SYSTEM","LS","S"]
[null,"S",699.06060000000002,"SPRINKLER SYSTEM","SF","S"]
[null,"S",699.06065000000001,"DRIP IRRIGATION SYSTEM","LS","S"]
[null,"S",699.06065999999998,"IRRIGATION SYSTEM","LS","S"]
[null,"S",699.0607,"POLYSTYRENE INSULATION","SY","S"]
[null,"S",699.06074999999998,"EXPANDED POLYSTYRENE BLOCKS","CY","S"]
[null,"S",699.07003999999995,"SANITARY SEWER LINE 4 in ","FT","S"]
[null,"S",699.07006000000001,"SANITARY SEWER LINE 6 in ","FT","S"]
[null,"S",699.07007999999996,"SANITARY SEWER LINE 8 in ","FT","S"]
[null,"S",699.07010000000002,"SANITARY SEWER LINE 10 in ","FT","S"]
[null,"S",699.07011999999997,"SANITARY SEWER LINE 12 in ","FT","S"]
[null,"S",699.07015000000001,"SANITARY SEWER LINE 15 in ","FT","S"]
[null,"S",699.07039999999995,"SEWER LINE REPLACEMENT","LS","S"]
[null,"S",699.07045000000005,"SANITARY SEWER LINE REPLACEMENT","LS","S"]
[null,"S",699.07050000000004,"SANITARY SEWER SYSTEM","LS","S"]
[null,"S",699.07055000000003,"STORM SEWER SYSTEM","LS","S"]
[null,"S",699.08004000000005,"PLASTIC SEWER  PIPE  4 in ","FT","S"]
[null,"S",699.08006,"PLASTIC SEWER  PIPE  6 in ","FT","S"]
[null,"S",699.08007999999995,"PLASTIC SEWER  PIPE  8 in ","FT","S"]
[null,"S",699.08010000000002,"PLASTIC SEWER  PIPE 10 in ","FT","S"]
[null,"S",699.08011999999997,"PLASTIC SEWER  PIPE 12 in ","FT","S"]
[null,"S",699.08015,"PLASTIC SEWER  PIPE 15 in ","FT","S"]
[null,"S",699.08018000000004,"PLASTIC SEWER  PIPE 18 in ","FT","S"]
[null,"S",699.08024,"PLASTIC SEWER  PIPE 24 in ","FT","S"]
[null,"S",701.11,"SALVAGING","LS","S"]
[null,null,701.12,"TRENCHING AND BACKFILLING","FT",""]
[null,null,701.12009999999998,"TRENCHING AND BACKFILLING","LS",""]
[null,null,701.12300000000005,"CONDUIT BORING","FT",""]
[null,null,701.125,"CONDUIT BORING","LS",""]
[null,null,701.17004999999995,"CONDUIT-RIGID STL 1/2 in ","FT",""]
[null,null,701.17006000000003,"CONDUIT-RIGID STL 1/2 in ","LS",""]
[null,null,701.17007000000001,"CONDUIT-RIGID STL 3/4 in ","FT",""]
[null,null,701.17007999999998,"CONDUIT-RIGID STL 3/4 in ","LS",""]
[null,null,701.17010000000005,"CONDUIT-RIGID STL 1 in ","FT",""]
[null,null,701.17011000000002,"CONDUIT-RIGID STL 1 in ","LS",""]
[null,null,701.17015000000004,"CONDUIT-RIGID STL 1 1/2 in ","FT",""]
[null,null,701.17016000000001,"CONDUIT-RIGID STL 1 1/2 in ","LS",""]
[null,null,701.17020000000002,"CONDUIT-RIGID STL 2 in ","FT",""]
[null,null,701.17021,"CONDUIT-RIGID STL 2 in ","LS",""]
[null,null,701.17025000000001,"CONDUIT-RIGID STL 2 1/2 in","FT",""]
[null,null,701.1703,"CONDUIT-RIGID STL 3 in ","FT",""]
[null,null,701.17030999999997,"CONDUIT-RIGID STL 3 in ","LS",""]
[null,null,701.17039999999997,"CONDUIT-RIGID STL 4 in ","FT",""]
[null,null,701.17040999999995,"CONDUIT-RIGID STL 4 in ","LS",""]
[null,null,701.17042000000004,"CONDUIT-RIGID STL 6 in","FT",""]
[null,null,701.17105000000004,"CONDUIT-RIGID PVC 3/4 in","FT",""]
[null,null,701.17110000000002,"CONDUIT-RIGID PVC 1 in ","FT",""]
[null,null,701.17111,"CONDUIT-RIGID PVC 1 in ","LS",""]
[null,null,701.17111999999997,"CONDUIT-RIGID PVC 1 ¼ in ","FT",""]
[null,null,701.1712,"CONDUIT-RIGID PVC 2 in ","FT",""]
[null,null,701.17120999999997,"CONDUIT-RIGID PVC 2 in ","LS",""]
[null,null,701.17124999999999,"CONDUIT-RIGID PVC 2 ½ in","FT",""]
[null,null,701.17129999999997,"CONDUIT-RIGID PVC 3 in ","FT",""]
[null,null,701.17130999999995,"CONDUIT-RIGID PVC 3 in ","LS",""]
[null,null,701.17139999999995,"CONDUIT-RIGID PVC 4 in ","FT",""]
[null,null,701.17141000000004,"CONDUIT-RIGID PVC 4 in ","LS",""]
[null,null,701.17160000000001,"CONDUIT-RIGID PVC 6 in ","FT",""]
[null,null,701.17160999999999,"CONDUIT-RIGID PVC 6 in ","LS",""]
[null,null,701.17168000000004,"CONDUIT-RIGID PVC 8 in","FT",""]
[null,null,701.17205000000001,"CONDUIT-FLEXIBLE METAL 1/2 in ","FT",""]
[null,null,701.17205999999999,"CONDUIT-FLEXIBLE METAL 1/2 in ","LS",""]
[null,null,701.17206999999996,"CONDUIT-FLEXIBLE METAL 3/4 in ","FT",{"$f":"IF(ISBLANK(B1602),\"\",B1602)","v":""}]
[null,null,701.17208000000005,"CONDUIT-FLEXIBLE METAL 3/4 in ","LS",""]
[null,null,701.1721,"CONDUIT-FLEXIBLE METAL 1 in ","FT",""]
[null,null,701.17210999999998,"CONDUIT-FLEXIBLE METAL 1 in ","LS",""]
[null,null,701.17600000000004,"REMOVE CONDUIT","FT",""]
[null,null,701.17610000000002,"REMOVE CONDUIT","LS",""]
[null,null,701.18,"CONDUIT HARDWARE","LS",""]
[null,null,701.19100000000003,"CONDUIT SYSTEM-BRIDGE","LS",""]
[null,null,701.19200000000001,"CONDUIT SYSTEM-BRIDGE TELEPHONE","LS",""]
[null,null,701.19299999999998,"CONDUIT SYSTEM-UNDERGROUND TELEPHONE","LS",""]
[null,null,701.19399999999996,"CONDUIT SYSTEM-CABLE TELEVISION","LS",""]
[null,null,701.19600000000003,"REMOVE CONDUIT SYSTEM","LS",""]
[null,null,701.20100000000002,"PULL BOX TYPE A","EA",""]
[null,null,701.202,"PULL BOX TYPE B","EA",""]
[null,null,701.20299999999997,"PULL BOX TYPE S","EA",""]
[null,null,701.20600000000002,"REMOVE PULL BOX","EA",""]
[null,null,701.20699999999999,"RESET PULL BOX","EA",""]
[null,null,701.21100000000001,"SERVICE POINT LIGHTING","EA",""]
[null,null,701.21299999999997,"SERVICE POINT SIGNAL","EA",""]
[null,null,701.21315000000004,"TYPE I SOLAR SERVICE POINT","EA",""]
[null,null,701.21325000000002,"TYPE II SOLAR SERVICE POINT","EA",""]
[null,null,701.21349999999995,"GROUND ROD","EA",""]
[null,null,701.21600000000001,"REMOVE SERVICE POINT","EA",""]
[null,null,701.21799999999996,"MODIFYSERVICE POINT","EA",""]
[null,null,701.24009999999998,"STL POLE TYPE I","EA",""]
[null,null,701.24019999999996,"STL POLE TYPE II","EA",""]
[null,null,701.24030000000005,"STL POLE TYPE III","EA",""]
[null,null,701.24040000000002,"STL POLE TYPE IV","EA",""]
[null,null,701.2405,"STL POLE TYPE V","EA",""]
[null,null,701.24059999999997,"STL POLE TYPE VI","EA",""]
[null,null,701.24069999999995,"STL POLE TYPE VII","EA",""]
[null,null,701.24080000000004,"CONC POLE TYPE VI","EA",""]
[null,null,701.24090000000001,"CONC POLE TYPE VII","EA",""]
[null,null,701.24400000000003,"INSTALL LIGHTING POLE","EA",""]
[null,"S",701.2441,"HIGHMAST LOWERING DEVICES","EA","S"]
[null,"S",701.24419999999998,"HIGHMAST LIGHTING CONTROL CABINET","EA","S"]
[null,"S",701.24429999999995,"HIGHMAST LUMINAIRE","EA","S"]
[null,null,701.24599999999998,"REMOVE LIGHTING POLE","EA",""]
[null,null,701.24699999999996,"RESET LIGHTING POLE","EA",""]
[null,null,701.24800000000005,"MODIFY LIGHTING POLE","EA",""]
[null,null,701.25599999999997,"REMOVE POLE FOUNDATION","EA",""]
[null,null,701.26,"SAFETY COVER ","EA",""]
[null,null,701.29,"SINGLE CONDUCTOR WIRE  #3/0 AWG","FT",""]
[null,null,701.29004999999995,"SINGLE CONDUCTOR WIRE  #4/0 AWG","FT",""]
[null,null,701.29010000000005,"SINGLE CONDUCTOR WIRE  #2/0 AWG","FT",""]
[null,null,701.29020000000003,"SINGLE CONDUCTOR WIRE  #1/0 AWG","FT",""]
[null,null,701.2903,"SINGLE CONDUCTOR WIRE  #1 AWG","FT",""]
[null,null,701.29039999999998,"SINGLE CONDUCTOR WIRE  #2 AWG","FT",""]
[null,null,701.29049999999995,"SINGLE CONDUCTOR WIRE  #4 AWG","FT",""]
[null,null,701.29060000000004,"SINGLE CONDUCTOR WIRE  #6 AWG","FT",""]
[null,null,701.29070000000002,"SINGLE CONDUCTOR WIRE  #8 AWG","FT",""]
[null,null,701.29079999999999,"SINGLE CONDUCTOR WIRE  #10 AWG","FT",""]
[null,null,701.29089999999997,"SINGLE CONDUCTOR WIRE  #12 AWG","FT",""]
[null,null,701.29100000000005,"SINGLE CONDUCTOR WIRE  #14 AWG","FT",""]
[null,null,701.29600000000005,"REMOVE SINGLE CONDUCTOR WIRE","FT",""]
[null,null,701.298,"ELECTRICAL CONDUCTORS","LS",""]
[null,"S",701.29899999999998,"ELECTRICAL CONDUCTORS-TEMPORARY SIGNAL","LS","S"]
[null,null,701.31010000000003,"SIGNAL CABLE 3 CONDUCTOR #14 AWG","FT",""]
[null,null,701.31020000000001,"SIGNAL CABLE 5 CONDUCTOR #14 AWG","FT",""]
[null,null,701.31029999999998,"SIGNAL CABLE 7 CONDUCTOR #14 AWG","FT",""]
[null,null,701.31039999999996,"SIGNAL CABLE 12 CONDUCTOR #14 AWG","FT",""]
[null,null,701.31050000000005,"SIGNAL CABLE 15 CONDUCTOR #14 AWG","FT",""]
[null,null,701.31055000000003,"SIGNAL CABLE 16 CONDUCTOR #12 AWG","FT",""]
[null,null,701.31060000000002,"SIGNAL CABLE 19 CONDUCTOR #14 AWG","FT",""]
[null,null,701.3107,"SIGNAL CABLE 21 CONDUCTOR #14 AWG","FT",{"$f":"IF(ISBLANK(B1666),\"\",B1666)","v":""}]
[null,"S",701.31600000000003,"REMOVE TRAFFIC SIGNAL CABLE","LS","S"]
[null,null,701.31799999999998,"LIGHTING CABLE 3 CONDUCTOR #12 AWG","FT",""]
[null,null,701.32,"LOOP DETECTOR WIRE","FT",""]
[null,null,701.33,"LOOP DETECTOR SHIELDED LEAD-IN CABLE","FT",""]
[null,null,701.36500000000001,"RADAR DETECTOR CABLE","FT",""]
[null,null,701.39,"SPLICING KIT","EA",""]
[null,null,701.40099999999995,"CONNECTOR KIT - FUSED I","EA",""]
[null,null,701.40200000000004,"CONNECTOR KIT - FUSED Y","EA",""]
[null,null,701.40300000000002,"CONNECTOR KIT - UNFUSED I","EA",""]
[null,null,701.404,"CONNECTOR KIT - UNFUSED Y","EA",""]
[null,null,701.45100000000002,"SIGNAL CONTROLLER","EA",""]
[null,null,701.45600000000002,"REMOVE SIGNAL CONTROLLER","EA",""]
[null,null,701.45699999999999,"RESET SIGNAL CONTROLLER","EA",""]
[null,null,701.46100000000001,"SIGNAL CONTROLLER CABINET","EA",""]
[null,null,701.46600000000001,"REMOVE SIGNAL CONTROLLER CABINET","EA",""]
[null,null,701.46699999999998,"RESET SIGNAL CONTROLLER CABINET","EA",""]
[null,null,701.46799999999996,"MODIFY SIGNAL CONTROLLER CABINET","EA",""]
[null,null,701.471,"SIGNAL CONTROLLER AUX EQP","LS",""]
[null,null,701.476,"REMOVE SIGNAL CONTROLLER AUX EQP","LS",""]
[null,null,701.47699999999998,"RESET SIGNAL CONTROLLER AUX EQP","LS",""]
[null,null,701.48099999999999,"TIME CLOCK","EA",""]
[null,null,701.48599999999999,"REMOVE TIME CLOCK","EA",""]
[null,null,701.48699999999997,"RESET TIME CLOCK","EA",""]
[null,null,701.50009999999997,"SIGNAL INDICATION 12 ","EA",""]
[null,null,701.50014999999996,"SIGNAL INDICATION 12-SOLAR","EA",""]
[null,null,701.50030000000004,"SIGNAL INDICATION 8-8-8 ","EA",""]
[null,null,701.50040000000001,"SIGNAL INDICATION 12-8-8","EA",""]
[null,null,701.50049999999999,"SIGNAL INDICATION 12-12-12 ","EA",""]
[null,null,701.50059999999996,"SIGNAL INDICATION 12-12-12-12-12","EA",""]
[null,null,701.50599999999997,"REMOVE SIGNAL INDICATION","EA",""]
[null,null,701.50699999999995,"RESET SIGNAL INDICATION","EA",""]
[null,null,701.51099999999997,"PED SIGNAL INDICATION","EA",""]
[null,null,701.51599999999996,"REMOVE PED SIGNAL INDICATION","EA",""]
[null,null,701.51700000000005,"RESET PED SIGNAL INDICATION","EA",""]
[null,null,701.52099999999996,"LOUVERED BACKPLATE 12-8-8","EA",""]
[null,null,701.52200000000005,"LOUVERED BACKPLATE 12-12-12","EA",""]
[null,null,701.52300000000002,"LOUVERED BACKPLATE 12-12-12-12-12","EA",""]
[null,null,701.53099999999995,"MAST ARM FRAMEWORK","EA",""]
[null,null,701.53200000000004,"POST TOP FRAMEWORK","EA",""]
[null,null,701.53300000000002,"SIDE BRACKET FRAMEWORK","EA",""]
[null,null,701.53599999999994,"REMOVE FRAMEWORK","EA",""]
[null,null,701.53700000000003,"RESET FRAMEWORK","EA",""]
[null,null,701.55,"SAW CUT LOOP DETECTOR","EA",""]
[null,null,701.56,"PREFAB LOOP DETECTOR","EA",""]
[null,null,701.57,"MICRO LOOP DETECTOR ","EA",""]
[null,null,701.57005000000004,"MICROWAVE DETECTOR","EA",""]
[null,null,701.58,"LOOP DETECTOR SEALANT","GAL",""]
[null,null,701.58299999999997,"REMOVE AND REINSTALL DETECTOR","EA",""]
[null,null,701.59100000000001,"PED DETECTOR","EA",""]
[null,null,701.59199999999998,"PED INSTRUCTION SIGN (9X12)","EA",""]
[null,null,701.62099999999998,"ROADWAY LUMINAIRE","EA",""]
[null,null,701.62599999999998,"REMOVE ROADWAY LUMINAIRE","EA",""]
[null,null,701.62699999999995,"RESET ROADWAY LUMINAIRE","EA",""]
[null,null,701.63099999999997,"REST AREA LUMINAIRE","EA",""]
[null,null,701.63599999999997,"REMOVE REST AREA LUMINAIRE","EA",""]
[null,null,701.63699999999994,"RESET REST AREA LUMINAIRE","EA",""]
[null,null,701.64099999999996,"OVERHEAD SIGN LUMINAIRE","EA",""]
[null,null,701.64599999999996,"REMOVE OVERHEAD SIGN LUMINAIRE","EA",""]
[null,null,701.64700000000005,"RESET OVERHEAD SIGN LUMINAIRE","EA",""]
[null,null,701.65099999999995,"UNDERPASS LUMINAIRE","EA",""]
[null,null,701.65599999999995,"REMOVE UNDERPASS LUMINAIRE","EA",""]
[null,null,701.65700000000004,"RESET UNDERPASS LUMINAIRE","EA",""]
[null,null,701.66099999999994,"TUNNEL LUMINAIRE","EA",""]
[null,"S",701.66200000000003,"TUNNEL LIGHTING FIXTURE MOUNTING HARDWARE","LS",{"$f":"IF(ISBLANK(B1730),\"\",B1730)","v":"S"}]
[null,null,701.66600000000005,"REMOVE TUNNEL LUMINAIRE","EA",""]
[null,null,701.66700000000003,"RESET TUNNEL LUMINAIRE","EA",""]
[null,null,701.7,"FLASHING BEACON SYSTEM","LS",""]
[null,null,701.71,"TRAFFIC SIGNAL SYSTEM","LS",""]
[null,"S",701.71199999999999,"REMOVE TRAFFIC SIGNAL SYSTEM","LS","S"]
[null,null,701.73,"ROADWAY LIGHTING SYSTEM","LS",""]
[null,null,701.74,"REST AREA LIGHTING SYSTEM","LS",""]
[null,null,701.75,"OVERHEAD SIGN LIGHTING SYSTEM","LS",""]
[null,null,701.76,"UNDERPASS LIGHTING SYSTEM","LS",""]
[null,null,701.77,"TUNNEL LIGHTING SYSTEM","LS",""]
[null,null,701.77200000000005,"REMOVE TUNNEL LIGHTING SYSTEM","LS",""]
[null,null,701.78,"BRIDGE LIGHTING SYSTEM","LS",""]
[null,null,701.8,"ROAD CLOSURE SYSTEM","LS",""]
[null,"S",701.81,"INTELLIGENT TRANSPORTATION SYSTEM","LS","S"]
[null,"S",701.81200000000001,"REMOTE CAMERA SYSTEM","LS","S"]
[null,"S",701.81299999999999,"ITS COMMUNICATION SYSTEM","LS","S"]
[null,"S",701.81600000000003,"HIGHWAY ADVISORY RADIO SYSTEM","LS","S"]
[null,"S",701.81700000000001,"ROAD WEATHER INFORMATION SYSTEM","LS","S"]
[null,"S",701.81799999999998,"OVERHEIGHT DETECTION SYSTEM","LS","S"]
[null,"S",701.82,"FIBER OPTICS COMMUNICATIONS SYSTEM","LS","S"]
[null,"S",701.82500000000005,"PORT OF ENTRY MANAGEMENT SYSTEM","LS","S"]
[null,null,701.83,"ELECTRICAL SYSTEM","LS",""]
[null,"S",701.84,"DYNAMIC MESSAGE SIGN -2 LINE-CHARACTER MATRIX ","EA","S"]
[null,"S",701.84005000000002,"DYNAMIC MESSAGE SIGN - SIDE MOUNT","EA","S"]
[null,"S",701.85,"DYNAMIC MESSAGE SIGN -3 LINE-LINE MATRIX ","EA","S"]
[null,"S",701.85005000000001,"DYNAMIC MESSAGE SIGN - OVERHEAD","EA","S"]
[null,"S",701.86,"DYNAMIC MESSAGE SIGN - BLANK OUT","EA","S"]
[null,"S",701.87,"VMS SYSTEM CENTRAL CONTROLLER","EA","S"]
[null,"S",701.88,"VMS SYSTEM REMOTE CONTROLLER","EA","S"]
[null,"S",701.89,"DYNAMIC MESSAGE SIGN SYSTEM","LS","S"]
[null,"S",701.89499999999998,"DYNAMIC MESSAGE SIGN-VARIABLE SPEED LIMIT","EA","S"]
[null,"S",701.89504999999997,"DYNAMIC MESSAGE SIGN-VARIABLE SPEED LIMIT (SOLAR)","EA","S"]
[null,"S",702.08,"RESET OVERHEAD SIGN","LS","S"]
[null,"S",702.09,"COLUMN EXTENSION","LS","S"]
[null,null,702.09100000000001,"STL OVERHEAD SIGN SUPPORT","LS",""]
[null,"S",702.09109999999998,"OVERHEAD SIGN STRUCTURE","LS","S"]
[null,"S",702.09119999999996,"SIGN STRUCTURE REPAIR","LS","S"]
[null,"S",702.09130000000005,"RESET OVERHEAD SIGN STRUCTURE","LS","S"]
[null,null,702.09299999999996,"STL BREAK-AWAY SIGN SUPPORT W6 X 12","FT",""]
[null,null,702.09304999999995,"STL BREAK-AWAY SIGN SUPPORT W6 X 12","LS",""]
[null,null,702.09400000000005,"STL BREAK-AWAY SIGN SUPPORT W6 X 15","FT",""]
[null,null,702.09405000000004,"STL BREAK-AWAY SIGN SUPPORT W6 X 15","LS",""]
[null,null,702.09500000000003,"STL BREAK-AWAY SIGN SUPPORT W8 X 21","FT",""]
[null,null,702.09505000000001,"STL BREAK-AWAY SIGN SUPPORT W8 X 21","LS",""]
[null,null,702.096,"STL BREAK-AWAY SIGN SUPPORT W10 X 26","FT",""]
[null,null,702.09604999999999,"STL BREAK-AWAY SIGN SUPPORT W10 X 26","LS",""]
[null,null,702.09699999999998,"STL BREAK-AWAY SIGN SUPPORT W14 X 30","FT",""]
[null,null,702.09704999999997,"STL BREAK-AWAY SIGN SUPPORT W14 X 30","LS",""]
[null,null,702.09709999999995,"STL BREAK-AWAY SIGN SUPPORT W18 X 35","FT",""]
[null,null,702.09712999999999,"STL BREAK-AWAY SIGN SUPPORT W18 X 40","FT",""]
[null,null,702.09715000000006,"STL BREAK-AWAY SIGN SUPPORT W21 X 44","FT",""]
[null,null,702.20100000000002,"REFERENCE MARKERS","EA",""]
[null,null,702.202,"REFERENCE MARKER PANELS","EA",""]
[null,"S",702.20299999999997,"FLEXIBLE REFERENCE MARKERS","EA","S"]
[null,null,702.30100000000004,"SIGN POSTS, WOOD 4 X 4 in","FT",""]
[null,null,702.30105000000003,"SIGN POSTS, WOOD 4 X 6 in","FT",""]
[null,null,702.30110000000002,"SIGN POSTS, WOOD 6 X 6 in","FT",""]
[null,null,702.30115000000001,"SIGN POSTS, WOOD 6 X 8 in","FT",""]
[null,null,702.30119999999999,"SIGN POSTS, WOOD 8 X 8 in","FT",""]
[null,null,702.30124999999998,"SIGN POSTS, WOOD 10 X 10 in","FT",""]
[null,null,702.30129999999997,"SIGN POSTS, WOOD 6 in RND","FT",""]
[null,null,702.30134999999996,"SIGN POSTS, WOOD 8 in RND","FT",""]
[null,null,702.30139999999994,"SIGN POSTS, WOOD 10 in RND","FT",""]
[null,null,702.30200000000002,"SIGN POSTS, STL PIPE (BREAK-AWAY)","LB",{"$f":"IF(ISBLANK(B1794),\"\",B1794)","v":""}]
[null,null,702.30205000000001,"SIGN POST, RND TUBULAR STL","EA",""]
[null,null,702.303,"SIGN POST, SQ TUBULAR STL","EA",""]
[null,null,702.30309999999997,"INSTALL SIGN PANELS, PLYWOOD ","SF",""]
[null,null,702.30319999999995,"INSTALL SIGN PANELS, ALUMINUM ","SF",""]
[null,null,702.30399999999997,"SIGN PANELS, PLYWOOD ","SF",""]
[null,null,702.30499999999995,"SIGN PANELS, ALUMINUM ","SF",""]
[null,"S",702.30501000000004,"SPLASH BOARDS","FT","S"]
[null,null,702.30600000000004,"RESET SIGNS","LS",""]
[null,"S",702.30700000000002,"INTERNALLY LIGHTED SIGN 10 ft-6 in X 13 ft-6 in ","EA","S"]
[null,"S",702.30799999999999,"INTERNALLY LIGHTED SIGN 10 ft-6 in X 15 ft-6 in ","EA","S"]
[null,null,702.50099999999998,"DELINEATORS, TYPE I","EA",""]
[null,null,702.50199999999995,"DELINEATORS, TYPE II","EA",""]
[null,null,702.50300000000004,"DELINEATORS, TYPE III","EA",""]
[null,null,702.50400000000002,"DELINEATORS, TYPE IV","EA",""]
[null,null,702.505,"DELINEATORS, TYPE V","EA",""]
[null,null,702.50599999999997,"DELINEATORS, TYPE VI","EA",""]
[null,null,702.50649999999996,"DELINEATORS, TYPE VII","EA",""]
[null,"D",702.50654999999995,"DELINEATORS, TYPE VIII","EA","D"]
[null,"D",702.50660000000005,"DELINEATORS, TYPE IX","EA","D"]
[null,"S",702.50699999999995,"RESET DELINEATORS","EA","S"]
[null,"S",702.50800000000004,"MIRRORED DEER DELINEATOR","EA","S"]
[null,"S",702.51,"FLEXIBLE DELINEATORS, TYPE I","EA","S"]
[null,"S",702.51009999999997,"FLEXIBLE DELINEATORS, TYPE II","EA","S"]
[null,"S",702.51020000000005,"FLEXIBLE DELINEATORS, TYPE III","EA","S"]
[null,"S",702.51030000000003,"FLEXIBLE DELINEATORS, TYPE IV","EA","S"]
[null,"S",702.5104,"FLEXIBLE DELINEATORS, TYPE V","EA","S"]
[null,"S",702.51049999999998,"FLEXIBLE DELINEATORS, TYPE VI","EA","S"]
[null,null,703.01,"CATEGORY I TCD UNITS","EA",""]
[null,null,703.01002000000005,"CATEGORY II TCD UNITS","EA",""]
[null,null,703.01003000000003,"CATEGORY III TCD UNITS","EA",""]
[null,null,703.01004,"CATEGORY IV TCD UNITS","EA",""]
[null,null,703.01004999999998,"CATEGORY V TCD UNITS","EA",""]
[null,null,703.03099999999995,"FLAGGING","HR",""]
[null,null,703.03110000000004,"TEMPORARY TRAFFIC CONTROL","LS",""]
[null,null,703.03200000000004,"SEQUENTIAL CHEVRON","LS",""]
[null,null,703.03201999999999,"SEQUENTIAL CHEVRON","EA",""]
[null,"S",703.03205000000003,"PORTABLE VARIABLE MESSAGE SIGN","LS","S"]
[null,"S",703.03210000000001,"PORTABLE VARIABLE MESSAGE SIGN","EA","S"]
[null,null,703.03409999999997,"TEMPORARY CONCRETE BARRIER","FT",""]
[null,null,703.03420000000006,"TEMPORARY CONCRETE TERMINAL","EA",""]
[null,null,703.03421000000003,"PLASTIC WATER BARRIER","FT",""]
[null,"S",703.03510000000006,"PORTABLE TRAFFIC SIGNAL SYSTEM","LS","S"]
[null,"S",703.03520000000003,"TEMPORARY TRAFFIC SIGNAL SYSTEM","LS","S"]
[null,"S",703.10199999999998,"IMPACT ATTENUATOR","EA","S"]
[null,"S",703.10209999999995,"IMPACT ATTENUATOR","LS","S"]
[null,"S",703.10299999999995,"IMPACT ATTENUATOR REPLACEMENTS","LS","S"]
[null,"S",703.10400000000004,"IMPACT ATTENUATOR REPLACEMENT KIT","EA","S"]
[null,"S",703.10500000000002,"IMPACT SAND BARREL-200 LBS","EA","S"]
[null,"S",703.10599999999999,"IMPACT SAND BARREL-400 LBS","EA","S"]
[null,"S",703.10699999999997,"IMPACT SAND BARREL-700 LBS","EA","S"]
[null,"S",703.10749999999996,"IMPACT SAND BARREL-1400 LBS","EA","S"]
[null,"S",703.10799999999995,"IMPACT SAND BARREL-2100 LBS","EA","S"]
[null,"S",703.10805100000005,"WC-3 BARRICADE SIGNS (ANCHORED)","EA","S"]
[null,"S",703.10810000000004,"WC-4 BARRICADE SIGNS (ANCHORED)","EA","S"]
[null,null,704.01,"TRAFFIC CONTROL MAINTENANCE                       (DO NOT USE)","SHFT",""]
[null,"S",799.60299999999995,"PAVEMENT LINE 4 in ","FT","S"]
[null,"S",799.60400000000004,"PAVEMENT LINE 8 in ","FT","S"]
[null,"S",799.60500000000002,"PAVEMENT LINE 12 in ","FT","S"]
[null,"S",799.60599999999999,"PAVEMENT LINE 18 in","FT","S"]
[null,"S",799.60699999999997,"PAVEMENT LINE 24 In","FT","S"]
[null,"S",799.70100000000002,"THERMOPLASTIC PAVEMENT MARKINGS","LS","S"]
[null,"S",799.70105000000001,"THERMOPLASTIC PAVEMENT MARKINGS","SF","S"]
[null,"S",799.70108000000005,"THERMOPLASTIC PAVEMENT MARKINGS 8 in","FT","S"]
[null,"S",799.70118000000002,"THERMOPLASTIC PAVEMENT MARKINGS 18 in","FT",{"$f":"IF(ISBLANK(B1858),\"\",B1858)","v":"S"}]
[null,"S",799.70123999999998,"THERMOPLASTIC PAVEMENT MARKINGS 24 in","FT","S"]
[null,"S",799.702,"PREFORMED PAVEMENT MARKINGS","SF","S"]
[null,"S",799.70399999999995,"PREFORMED PAVEMENT LINE 4 in ","FT","S"]
[null,"S",799.70600000000002,"PREFORMED PAVEMENT LINE 6 in ","FT","S"]
[null,"S",799.70699999999999,"PREFORMED PAVEMENT LINE 7 in ","FT","S"]
[null,"S",799.70799999999997,"PREFORMED PAVEMENT LINE 8 in ","FT","S"]
[null,"S",799.71199999999999,"PREFORMED PAVEMENT LINE 12 in ","FT","S"]
[null,"S",799.71799999999996,"PREFORMED PAVEMENT LINE 18 in ","FT","S"]
[null,"S",799.71803999999997,"PREFORMED PAVEMENT LINE 24 in","FT","S"]
[null,"S",799.71804999999995,"EPOXY PAVEMENT MARKINGS","LS","S"]
[null,"S",799.71810000000005,"EPOXY PAVEMENT LINE 4 in ","FT","S"]
[null,"S",799.71815000000004,"EPOXY PAVEMENT LINE 8 in ","FT","S"]
[null,"S",799.71820000000002,"EPOXY PAVEMENT LINE 12 in ","FT","S"]
[null,"S",799.71825000000001,"EPOXY PAVEMENT LINE 18 in ","FT","S"]
[null,"S",799.7183,"EPOXY PAVEMENT LINE 24 in ","FT","S"]
[null,"S",799.71900000000005,"SOLID LINE STRIPING","MI","S"]
[null,"S",799.72,"DASHED CENTERLINE STRIPING","MI","S"]
[null,"S",799.73,"PREFORMED PAVEMENT MARKINGS FOR WORDS AND SYMBOLS","LS","S"]
[null,"S",799.74,"PAVEMENT MARKINGS FOR WORDS AND SYMBOLS","SF","S"]
[null,"S",799.74099999999999,"TEMPORARY RUNWAY PAVEMENT MARKING","SF","S"]
[null,"S",799.74199999999996,"TEMPORARY TAXIWAY PAVEMENT MARKING","SF","S"]
[null,"S",799.74300000000005,"TEMPORARY APRON MARKING","SF","S"]
[null,"S",799.74400000000003,"TEMPORARY BLASTPAD MARKING","SF","S"]
[null,"S",799.745,"PERMANENT RUNWAY MARKING","SF","S"]
[null,"S",799.74599999999998,"PERMANENT TAXIWAY MARKING","SF","S"]
[null,"S",799.74699999999996,"PERMANENT APRON MARKING","SF","S"]
[null,"S",799.74800000000005,"PERMANENT BLASTPAD MARKING","SF","S"]
[null,"S",799.74900000000002,"PAVEMENT MARKING REMOVAL","SF","S"]
[null,"S",799.75,"RAILROAD CROSSING PAVEMENT MARKING","EA","S"]
[null,"S",799.76,"LED-BLANKOUT SIGN","EA","S"]
[null,"S",900.4,"CONTRACTOR QUALITY CONTROL PLAN (CONCRETE)","LS","S"]
[null,"S",900.5,"CONTRACTOR MIX DESIGN (CONCRETE)","LS","S"]
[null,"S",900.6,"CONTRACTOR QUALITY CONTROL (CONCRETE)","LS","S"]
[null,"S",900.9,"CONTRACTOR QUALITY CONTROL PLAN (PCCP)","LS","S"]
[null,"S",900.91,"CONTRACTOR MIX DESIGN (PCCP)","LS","S"]
[null,"S",900.92,"CONTRACTOR QUALITY CONTROL (PCCP)","LS","S"]
[null,"S",900.93,"RAILROAD FLAGGING","DAY","S"]
[null,null,999.01,"QUALITY ASSURANCE GRADATION","$$",""]
[null,null,999.02,"QUALITY ASSURANCE DENSITY","$$",""]
[null,null,999.03,"QUALITY ASSURANCE ASPHALT CONTENT","$$",""]
[null,null,999.04,"QUALITY ASSURANCE RIDEABILITY","$$",""]
[null,null,999.05,"ADJUSTMENT FOR MISCELLANEOUS ITEMS","$$",""]
[null,null,999.06,"ADJUSTMENT OF PERFORMANCE BOND","$$",""]
[null,null,999.07,"INCENTIVE FOR COMPLETION PAY","$$",""]
[null,null,999.08,"ADJUSTING OF TEMPORARY TRAFFIC CONTROL","$$",""]
[null,null,999.09,"ADJUSTMENT FOR TRAFFIC CONTROL MAINTAINER","$$",""]
[null,null,999.1,"ADJUSTMENT FOR UNAUTHORIZED SUBCONTRACTOR","$$",""]
[null,null,999.11,"ADJUSTMENT FOR OVERTIME CHARGES","$$",""]
[null,null,999.12,"QUALITY ASSURANCE PGAB","$$",""]
[null,null,999.13,"QUALITY ASSURANCE STRUCTURAL CONCRETE","$$",""]
[null,null,999.13009999999997,"QUALITY ASSURANCE PCCP","$$",""]
[null,"S",999.14,"LANE RENTAL","$$","S"]
[null,null,999.15,"ADJUSTMENT FOR MOTOR FUEL (DIESEL)","$$",""]
[null,null,999.16,"ADJUSTMENT FOR MOTOR FUEL (UNLEADED)","$$",""]
[null,null,999.17,"ADJUSTMENT FOR BURNER FUEL","$$",""]
[null,null,999.18,"ADJUSTMENT FOR CRACK SEALANT","$$",""]
[null,null,999.19,"ADJUSTMENT FOR CHIP SEAL","$$",""]
[null,null,999.2,"ADJUSTMENT FOR EMULSIFIED ASPHALT","$$",""]
[null,null,999.21,"ADJUSTMENT FOR CUTBACK ASPHALT","$$",""]
[null,null,999.22,"ADJUSTMENT FOR PERFORMANCE GRADED ASPHALT BINDER","$$",""]
[null,null,999.25,"STRUCTURE ITEMS","LS",""]
[null,null,999.26,"TRAFFIC ITEMS","LS",""]
[null,null,999.27,"MISCELLANEOUS ITEMS","LS",""]
[null,null,null,null,null,{"$f":"IF(ISBLANK(B1922),\"\",B1922)","v":""}]
[null,null,null,null,null,""]
[null,null,null,null,null,""]
[null,null,null,null,null,""]
[null,null,null,null,null,""]
[null,null,null,null,null,""]
[null,null,null,null,null,""]
[null,null,null,null,null,""]
[null,null,null,null,null,""]
[null,null,null,null,null,""]
[null,null,null,null,null,""]
[null,null,null,null,null,""]
[null,null,null,null,null,""]
[null,null,null,null,null,""]
[null,null,null,null,null,""]
[null,null,null,null,null,""]
[null,null,null,null,null,""]
[null,null,null,null,null,""]
[null,null,null,null,null,""]
[null,null,null,null,null,""]
[null,null,null,null,null,""]
[null,null,null,null,null,""]
[null,null,null,null,null,""]
[null,null,null,null,null,""]
[null,null,null,null,null,""]
[null,null,null,null,null,""]
[null,null,null,null,null,""]
[null,null,null,null,null,""]
[null,null,null,null,null,""]
[null,null,null,null,null,""]
[null,null,null,null,null,""]
[null,null,null,null,null,""]
[null,null,null,null,null,""]
[null,null,null,null,null,""]
[null,null,null,null,null,""]
[null,null,null,null,null,""]
[null,null,null,null,null,""]
[null,null,null,null,null,""]
[null,null,null,null,null,""]
[null,null,null,null,null,""]
[null,null,null,null,null,""]
[null,null,null,null,null,""]
[null,null,null,null,null,""]
[null,null,null,null,null,""]
[null,null,null,null,null,""]
[null,null,null,null,null,""]
[null,null,null,null,null,""]
[null,null,null,null,null,""]
[null,null,null,null,null,""]
[null,null,null,null,null,""]
[null,null,null,null,null,""]
[null,null,null,null,null,""]
[null,null,null,null,null,""]
[null,null,null,null,null,""]
[null,null,null,null,null,""]
[]
[]
[]
[]
[]
[]
[]
[]
[]
[]
[]
["A"]

{"sheet":"Alphabetical","index":3,"n_rows":2015,"n_cols":5,"rows_kept":2015,"cut":false,"hidden":false,"merged":[]}
["Select","S","ITEM NO.","ITEM","UNIT"]
[null,"S",599.00088000000005,"ABUTMENT RAISING","LS"]
[null,"S",615.08010000000002,"ADJUST CATTLE GUARD","EA"]
[null,null,999.08,"ADJUSTING OF TEMPORARY TRAFFIC CONTROL","$$"]
[null,"S",199.00004999999999,"ADJUSTING UTILITIES","$$"]
[null,null,999.17,"ADJUSTMENT FOR BURNER FUEL","$$"]
[null,null,999.19,"ADJUSTMENT FOR CHIP SEAL","$$"]
[null,null,999.18,"ADJUSTMENT FOR CRACK SEALANT","$$"]
[null,null,999.21,"ADJUSTMENT FOR CUTBACK ASPHALT","$$"]
[null,null,999.2,"ADJUSTMENT FOR EMULSIFIED ASPHALT","$$"]
[null,null,999.05,"ADJUSTMENT FOR MISCELLANEOUS ITEMS","$$"]
[null,null,999.15,"ADJUSTMENT FOR MOTOR FUEL (DIESEL)","$$"]
[null,null,999.16,"ADJUSTMENT FOR MOTOR FUEL (UNLEADED)","$$"]
[null,null,999.11,"ADJUSTMENT FOR OVERTIME CHARGES","$$"]
[null,null,999.22,"ADJUSTMENT FOR PERFORMANCE GRADED ASPHALT BINDER","$$"]
[null,null,999.09,"ADJUSTMENT FOR TRAFFIC CONTROL MAINTAINER","$$"]
[null,null,999.1,"ADJUSTMENT FOR UNAUTHORIZED SUBCONTRACTOR","$$"]
[null,null,999.06,"ADJUSTMENT OF PERFORMANCE BOND","$$"]
[null,null,620.07000000000005,"ADJUSTMENTS, FIRE HYDRANTS  ","EA"]
[null,null,620.07010000000002,"ADJUSTMENTS, VALVE BOXES ","EA"]
[null,"S",599.00091999999995,"APPROACH SLAB REPAIR","LS"]
[null,"S",403.05,"ARAMID FIBERS","LB"]
[null,"S",511.09,"ARTICULATED BLOCK RIPRAP","SY"]
[null,null,401.03321,"ASPHALT BINDER (PG 58-28)","TON"]
[null,null,401.03327000000002,"ASPHALT BINDER (PG 58-34)","TON"]
[null,null,401.03323,"ASPHALT BINDER (PG 64-22)","TON"]
[null,null,401.03321999999997,"ASPHALT BINDER (PG 64-28)","TON"]
[null,null,401.03325999999998,"ASPHALT BINDER (PG 64-34)","TON"]
[null,null,401.03323999999998,"ASPHALT BINDER (PG 70-22)","TON"]
[null,null,401.03325000000001,"ASPHALT BINDER (PG 70-28)","TON"]
[null,null,401.03327999999999,"ASPHALT BINDER (PG 70-34)","TON"]
[null,"S",401.0333,"ASPHALT BINDER (PG 70E-28)","TON"]
[null,null,401.03329000000002,"ASPHALT BINDER (PG 76-28)","TON"]
[null,"S",499.03339999999997,"ASPHALT EMULSION (FDR)","TON"]
[null,"S",411.01024999999998,"ASPHALT REINFORCEMENT GRID","SY"]
[null,"S",399.00038999999998,"ASPHALT STABILIZED FULL DEPTH RECLAMATION","SY"]
[null,"S",399.00024999999999,"ASPHALT TREATED PERMEABLE BASE","TON"]
[null,null,210.03710000000001,"BACKHOE","HR"]
[null,"S",512.01009999999997,"BEARING DEVICE MODIFICATION","LS"]
[null,null,301.01060000000001,"BED COURSE MATERIAL","TON"]
[null,null,301.01065,"BED COURSE MATERIAL","CY"]
[null,null,301.01065999999997,"BED COURSE MATERIAL","SY"]
[null,"S",216.03955999999999,"BENTONITE DITCH LINING","SY"]
[null,"S",217.01065,"BIAXIAL GEOGRID","SY"]
[null,"S",217.01069000000001,"BIAXIAL GEOGRID (STIFF)","SY"]
[null,null,608.10299999999995,"BIKE PATH (CONC)","SY"]
[null,null,608.10305000000005,"BIKE PATH (CONC)","SF"]
[null,null,412.0104,"BIKE PATH (PLANT MIX)","TON"]
[null,null,412.01049999999998,"BIKE PATH (PLANT MIX)","SY"]
[null,"S",499.03359999999998,"BITUMINOUS SEAL COAT","GAL"]
[null,"S",299.02,"BLAST HOLE","FT"]
[null,null,302,"BLENDED BASE","TON "]
[null,null,302.00020000000001,"BLENDED BASE","CY"]
[null,null,302.00009999999997,"BLENDED SUBBASE","TON "]
[null,null,302.00029999999998,"BLENDED SUBBASE","CY"]
[null,null,408.012,"BLOTTER","TON"]
[null,null,203.02,"BORROW SPECIAL EXCAVATION","CY"]
[null,null,203.02109999999999,"BORROW SPECIAL EXCAVATION","TON"]
[null,"S",606.05015000000003,"BOX BEAM END TERM (WYBET SELF-OXIDIZING)","EA"]
[null,null,606.05012999999997,"BOX BEAM END TERM (WYBET)","EA"]
[null,null,606.05014000000006,"BOX BEAM END TERM (WYBET) MOD","EA"]
[null,null,606.04999999999995,"BOX BEAM GUARDRAIL","FT"]
[null,"S",606.05005000000006,"BOX BEAM GUARDRAIL (SELF-OXIDIZING)","FT"]
[null,null,606.05010000000004,"BOX BEAM GUARDRAIL END ANCH TYPE  I","EA"]
[null,"S",606.05011000000002,"BOX BEAM GUARDRAIL END ANCH TYPE  I (SELF OXIDIZING)","EA"]
[null,null,606.05011999999999,"BOX BEAM GUARDRAIL END ANCH TYPE II","EA"]
[null,null,606.05999999999995,"BOX BEAM MED BARRIER","FT"]
[null,null,606.06010000000003,"BOX BEAM MED BARRIER END ANCH TYPE  I","EA"]
[null,null,606.06011999999998,"BOX BEAM MED BARRIER END ANCH TYPE II","EA"]
[null,null,606.06012999999996,"BOX BEAM MED BARRIER END TERM (WYBET)","EA"]
[null,null,607.80100000000004,"BRACE PANELS","EA"]
[null,"SD",607.80499999999995,"BRACE PANELS (DEER)","EA"]
[null,null,607.80399999999997,"BRACE PANELS (INDUSTRIAL)","EA"]
[null,"SD",607.80600000000004,"BRACE PANELS (SPECIAL)","EA"]
[null,null,607.80700000000002,"BRACE PANELS (TEMPORARY)           DO NOT USE","EA"]
[null,"S",299.02210000000002,"BREAKING BOULDERS","FT"]
[null,null,507.01100000000002,"BRIDGE APPROACH BACKFILL ","CY"]
[null,null,505.01,"BRIDGE BARRIER ","FT"]
[null,"S",599.00077999999996,"BRIDGE CONCRETE REPAIR","LS"]
[null,"S",599.00080000000003,"BRIDGE CONCRETE REPAIR","SF"]
[null,"S",599.00031999999999,"BRIDGE DECK MEMBRANE","SY"]
[null,"S",599.00045999999998,"BRIDGE DECK OVERLAY (EPOXY CONCRETE)","SF"]
[null,"S",599.00046999999995,"BRIDGE DECK OVERLAY (EPOXY)","SY"]
[null,"S",599.00048000000004,"BRIDGE DECK OVERLAY (POLYESTER CONCRETE)","SF"]
[null,"S",515.02750000000003,"BRIDGE DECK REPAIR","SY"]
[null,null,515.02710000000002,"BRIDGE DECK REPAIR CLASS I-A","SY"]
[null,null,515.02719999999999,"BRIDGE DECK REPAIR CLASS I-B","SY"]
[null,null,515.02729999999997,"BRIDGE DECK REPAIR CLASS II-A","SY"]
[null,null,515.02739999999994,"BRIDGE DECK REPAIR CLASS II-B","SY"]
[null,"S",515.02809999999999,"BRIDGE DECK REPAIR, HYDRO-DEMOLITION","SY"]
[null,"S",599.00036,"BRIDGE DECK SEALER","SY"]
[null,"S",599.00034000000005,"BRIDGE DECK WEATHER PROOFING","LS"]
[null,"S",599.00098000000003,"BRIDGE ERECTION","LS"]
[null,null,701.78,"BRIDGE LIGHTING SYSTEM","LS"]
[null,null,505.01100000000002,"BRIDGE MEDIAN BARRIER","FT"]
[null,null,503.01,"BRIDGE RAILING","FT"]
[null,"S",503.01220000000001,"BRIDGE RAILING ANCHOR BOLT REPAIR","EA"]
[null,null,503.01100000000002,"BRIDGE RAILING MODIFICATION","FT"]
[null,null,503.012,"BRIDGE RAILING MODIFICATION","LS"]
[null,"S",599.00099999999998,"BULKHEADS","LS"]
[null,null,210.03200000000001,"BULLDOZER","HR"]
[null,null,215.03200000000001,"BURLAP BAG CURB","FT"]
[null,"SD",606.06724999999994,"CABLE MEDIAN BARRIER","FT"]
[null,"SD",606.06730000000005,"CABLE MEDIAN BARRIER GATING TERMINAL","EA"]
[null,"S",699.05325000000005,"CAST IRON 22.5 DEGREE BENDS 10 in ","EA"]
[null,"S",699.05322000000001,"CAST IRON 22.5 DEGREE BENDS 8 in ","EA"]
[null,"S",699.05345,"CAST IRON 45 DEGREE BENDS 10 in ","EA"]
[null,"S",699.05349999999999,"CAST IRON 45 DEGREE BENDS 12 in ","EA"]
[null,"S",699.05312000000004,"CAST IRON TEE 12 in X 10 in X 12 in","EA"]
[null,"S",699.05211999999995,"CAST IRON TEE 12 in X 8 in X 12 in","EA"]
[null,"S",699.05010000000004,"CAST IRON VALVE 10 in ","EA"]
[null,"S",699.05011999999999,"CAST IRON VALVE 12 in ","EA"]
[null,"S",699.05007999999998,"CAST IRON VALVE 8 in ","EA"]
[null,"D",625.33000000000004,"CATCH BASIN TYPE A","EA"]
[null,null,703.01,"CATEGORY I TCD UNITS","EA"]
[null,null,703.01002000000005,"CATEGORY II TCD UNITS","EA"]
[null,null,703.01003000000003,"CATEGORY III TCD UNITS","EA"]
[null,null,703.01004,"CATEGORY IV TCD UNITS","EA"]
[null,null,703.01004999999998,"CATEGORY V TCD UNITS","EA"]
[null,null,615.01012000000003,"CATTLE GUARD (HEAVY DUTY) 12 ft ","EA"]
[null,null,615.01017999999999,"CATTLE GUARD (HEAVY DUTY) 18 ft ","EA"]
[null,null,615.01023999999995,"CATTLE GUARD (HEAVY DUTY) 24 ft ","EA"]
[null,null,615.01030000000003,"CATTLE GUARD (HEAVY DUTY) 30 ft ","EA"]
[null,null,615.01035999999999,"CATTLE GUARD (HEAVY DUTY) 36 ft ","EA"]
[null,null,615.01041999999995,"CATTLE GUARD (HEAVY DUTY) 42 ft ","EA"]
[null,null,615.01048000000003,"CATTLE GUARD (HEAVY DUTY) 48 ft ","EA"]
[null,null,615.01059999999995,"CATTLE GUARD (HEAVY DUTY) 60 ft ","EA"]
[null,null,615.02012000000002,"CATTLE GUARD (MEDIUM DUTY) 12 ft ","EA"]
[null,null,615.02017999999998,"CATTLE GUARD (MEDIUM DUTY) 18 ft ","EA"]
[null,null,615.02023999999994,"CATTLE GUARD (MEDIUM DUTY) 24 ft ","EA"]
[null,null,615.02030000000002,"CATTLE GUARD (MEDIUM DUTY) 30 ft ","EA"]
[null,null,615.02035999999998,"CATTLE GUARD (MEDIUM DUTY) 36 ft ","EA"]
[null,null,615.02041999999994,"CATTLE GUARD (MEDIUM DUTY) 42 ft ","EA"]
[null,"SD",615.07060000000001,"CATTLE GUARD SPECIAL","EA"]
[null,null,615.08000000000004,"CATTLE GUARD SWING-WING","EA"]
[null,"S",499.0335,"CEMENT (FDR)","TON"]
[null,"S",499.03365000000002,"CEMENT POLYMER SEAL COAT","SY"]
[null,"S",399.00022999999999,"CEMENT STABILIZED FULL DEPTH RECLAMATION","SY"]
[null,"S",305.01,"CEMENT TREATED BASE","TON"]
[null,"S",305.01004999999998,"CEMENT TREATED BASE","CY"]
[null,null,409.03070000000002,"CHIP SEAL","SY"]
[null,null,409.03075000000001,"CHIP SEAL (OVERSHOOT)","SY"]
[null,null,513.00004999999999,"CLASS A CONCRETE","LS"]
[null,null,513.00009999999997,"CLASS A CONCRETE","CY"]
[null,null,513.00014999999996,"CLASS B CONCRETE","LS"]
[null,null,513.00019999999995,"CLASS B CONCRETE","CY"]
[null,null,513.00025000000005,"CLASS S CONCRETE","LS"]
[null,null,513.00300000000004,"CLASS S CONCRETE","CY"]
[null,null,201.03200000000001,"CLEARING AND GRUBBING","LS"]
[null,null,201.03201000000001,"CLEARING AND GRUBBING","ACRE"]
[null,null,201.03210000000001,"CLEARING TREES 10 in ","EA"]
[null,null,201.03218000000001,"CLEARING TREES 18 in ","EA"]
[null,null,201.03224,"CLEARING TREES 24 in ","EA"]
[null,null,201.03229999999999,"CLEARING TREES 30 in ","EA"]
[null,null,201.03247999999999,"CLEARING TREES 48 in","EA"]
[null,null,201.03206,"CLEARING TREES 6 in ","EA"]
[null,null,201.0326,"CLEARING TREES 60 in","EA"]
[null,null,201.03208000000001,"CLEARING TREES 8 in ","EA"]
[null,null,603.50102000000004,"CMP 102 in  ","FT"]
[null,null,603.50108,"CMP 108 in  ","FT"]
[null,null,603.50113999999996,"CMP 114 in  ","FT"]
[null,null,603.50012000000004,"CMP 12 in  ","FT"]
[null,null,603.50120000000004,"CMP 120 in  ","FT"]
[null,null,603.50014999999996,"CMP 15 in  ","FT"]
[null,null,603.50018,"CMP 18 in  ","FT"]
[null,null,603.50023999999996,"CMP 24 in  ","FT"]
[null,null,603.50030000000004,"CMP 30 in  ","FT"]
[null,null,603.50036,"CMP 36 in  ","FT"]
[null,null,603.50041999999996,"CMP 42 in  ","FT"]
[null,null,603.50048000000004,"CMP 48 in  ","FT"]
[null,null,603.50054,"CMP 54 in  ","FT"]
[null,null,603.50005999999996,"CMP 6 in  ","FT"]
[null,null,603.50059999999996,"CMP 60 in  ","FT"]
[null,null,603.50066000000004,"CMP 66 in  ","FT"]
[null,null,603.50072,"CMP 72 in  ","FT"]
[null,null,603.50077999999996,"CMP 78 in  ","FT"]
[null,null,603.50008000000003,"CMP 8 in  ","FT"]
[null,null,603.50084000000004,"CMP 84 in  ","FT"]
[null,null,603.5009,"CMP 90 in  ","FT"]
[null,null,603.50095999999996,"CMP 96 in  ","FT"]
[null,null,603.60103000000004,"CMP ARCH 103 X 71 in  ","FT"]
[null,null,603.60112000000004,"CMP ARCH 112 X 75 in  ","FT"]
[null,null,603.60117000000002,"CMP ARCH 117 X 79 in  ","FT"]
[null,null,603.60127999999997,"CMP ARCH 128 X 83 in  ","FT"]
[null,null,603.60136999999997,"CMP ARCH 137 X 87 in  ","FT"]
[null,null,603.60141999999996,"CMP ARCH 142 X 91 in  ","FT"]
[null,null,603.60017000000005,"CMP ARCH 17 X 13 in  ","FT"]
[null,null,603.60020999999995,"CMP ARCH 21 X 15 in  ","FT"]
[null,null,603.60023999999999,"CMP ARCH 24 X 18 in  ","FT"]
[null,null,603.60028,"CMP ARCH 28 X 20 in  ","FT"]
[null,null,603.60035000000005,"CMP ARCH 35 X 24 in  ","FT"]
[null,null,603.60036000000002,"CMP ARCH 36 X 24 in  ","FT"]
[null,null,603.60041999999999,"CMP ARCH 42 X 29 in  ","FT"]
[null,null,603.60049000000004,"CMP ARCH 49 X 33 in  ","FT"]
[null,null,603.60056999999995,"CMP ARCH 57 X 38 in  ","FT"]
[null,null,603.60059999999999,"CMP ARCH 60 X 36 in  ","FT"]
[null,null,603.60060999999996,"CMP ARCH 60 X 46 in","FT"]
[null,null,603.60064,"CMP ARCH 64 X 43 in  ","FT"]
[null,null,603.60065999999995,"CMP ARCH 66 X 51 in","FT"]
[null,null,603.60071000000005,"CMP ARCH 71 X 47 in  ","FT"]
[null,null,603.60073,"CMP ARCH 73 X 55 in  ","FT"]
[null,null,603.60081000000002,"CMP ARCH 81 X 59 in  ","FT"]
[null,null,603.60082999999997,"CMP ARCH 83 X 57 in  ","FT"]
[null,null,603.60086999999999,"CMP ARCH 87 X 63 in  ","FT"]
[null,null,603.60095000000001,"CMP ARCH 95 X 67 in  ","FT"]
[null,null,603.62103999999999,"CMP ARCH FE SECT 104 X 72 in  ","EA"]
[null,null,603.62017000000003,"CMP ARCH FE SECT 17 X 13 in  ","EA"]
[null,null,603.62021000000004,"CMP ARCH FE SECT 21 X 15 in  ","EA"]
[null,null,603.62023999999997,"CMP ARCH FE SECT 24 X 18 in  ","EA"]
[null,null,603.62027999999998,"CMP ARCH FE SECT 28 X 20 in  ","EA"]
[null,null,603.62035000000003,"CMP ARCH FE SECT 35 X 24 in  ","EA"]
[null,null,603.62036000000001,"CMP ARCH FE SECT 36 X 24 in  ","EA"]
[null,null,603.62041999999997,"CMP ARCH FE SECT 42 X 29 in  ","EA"]
[null,null,603.62049000000002,"CMP ARCH FE SECT 49 X 33 in  ","EA"]
[null,null,603.62057000000004,"CMP ARCH FE SECT 57 X 38 in    ","EA"]
[null,null,603.62059999999997,"CMP ARCH FE SECT 60 X 36 in","EA"]
[null,null,603.62061000000006,"CMP ARCH FE SECT 60 X 46 in","EA"]
[null,null,603.62063999999998,"CMP ARCH FE SECT 64 X 43 in  ","EA"]
[null,null,603.62066000000004,"CMP ARCH FE SECT 66 X 51 in","EA"]
[null,null,603.62071000000003,"CMP ARCH FE SECT 71 X 47 in  ","EA"]
[null,null,603.62072999999998,"CMP ARCH FE SECT 73 X 55 in  ","EA"]
[null,null,603.52012000000002,"CMP FE SECT 12 in  ","EA"]
[null,null,603.52014999999994,"CMP FE SECT 15 in  ","EA"]
[null,null,603.52017999999998,"CMP FE SECT 18 in  ","EA"]
[null,null,603.52023999999994,"CMP FE SECT 24 in  ","EA"]
[null,null,603.52030000000002,"CMP FE SECT 30 in  ","EA"]
[null,null,603.52035999999998,"CMP FE SECT 36 in  ","EA"]
[null,null,603.52041999999994,"CMP FE SECT 42 in  ","EA"]
[null,null,603.52048000000002,"CMP FE SECT 48 in  ","EA"]
[null,null,603.52053999999998,"CMP FE SECT 54 in  ","EA"]
[null,null,603.52059999999994,"CMP FE SECT 60 in  ","EA"]
[null,null,603.52066000000002,"CMP FE SECT 66 in  ","EA"]
[null,null,603.52071999999998,"CMP FE SECT 72 in  ","EA"]
[null,null,603.52077999999995,"CMP FE SECT 78 in  ","EA"]
[null,null,603.52084000000002,"CMP FE SECT 84 in  ","EA"]
[null,null,216.03954999999999,"COCONUT FIBER DITCH LINING","SY"]
[null,"S",499.0333,"COLD IN-PLACE RECYCLING","SY"]
[null,"S",699.01061000000004,"COLORING AND TEXTURING CONCRETE SURFACES","SF"]
[null,"S",702.09,"COLUMN EXTENSION","LS"]
[null,null,512.0104,"COMPRESSED JOINT MATERIAL","FT"]
[null,null,701.24080000000004,"CONC POLE TYPE VI","EA"]
[null,null,701.24090000000001,"CONC POLE TYPE VII","EA"]
[null,null,415.02015,"CONC PVMT SPALL REPAIR","SF"]
[null,null,415.02015999999998,"CONC PVMT SPALL REPAIR","CF"]
[null,null,415.02010000000001,"CONC SLAB REPLACEMENT","SY"]
[null,null,608.101,"CONCRETE","SY"]
[null,null,608.10104999999999,"CONCRETE","SF"]
[null,"S",607.10104999999999,"CONCRETE (SPECIAL)","CY"]
[null,"S",499.03359,"CONCRETE PAVEMENT SPECIAL","SY"]
[null,null,414.01,"CONCRETE PVMT","SY"]
[null,"S",414.01010000000002,"CONCRETE PVMT","CY"]
[null,null,414.01049999999998,"CONCRETE PVMT (10 in) ","SY"]
[null,null,414.01055000000002,"CONCRETE PVMT (10.5 in) ","SY"]
[null,null,414.01060000000001,"CONCRETE PVMT (11 in) ","SY"]
[null,null,414.01060999999999,"CONCRETE PVMT (12 in) ","SY"]
[null,null,414.01031,"CONCRETE PVMT (6 in) ","SY"]
[null,null,414.01035000000002,"CONCRETE PVMT (8 in) ","SY"]
[null,null,414.0104,"CONCRETE PVMT (9 in) ","SY"]
[null,"S",414.01022,"CONCRETE PVMT (HIGH EARLY 10 in) ","SY"]
[null,"S",414.01011,"CONCRETE PVMT (HIGH EARLY 8 in) ","SY"]
[null,"S",414.01020999999997,"CONCRETE PVMT (HIGH EARLY 9 in) ","SY"]
[null,"S",414.0102,"CONCRETE PVMT (HIGH EARLY)","SY"]
[null,"S",599.00076000000001,"CONCRETE REPAIR MATERIAL","CF"]
[null,null,701.12300000000005,"CONDUIT BORING","FT"]
[null,null,701.125,"CONDUIT BORING","LS"]
[null,null,701.18,"CONDUIT HARDWARE","LS"]
[null,null,701.19100000000003,"CONDUIT SYSTEM-BRIDGE","LS"]
[null,null,701.19200000000001,"CONDUIT SYSTEM-BRIDGE TELEPHONE","LS"]
[null,null,701.19399999999996,"CONDUIT SYSTEM-CABLE TELEVISION","LS"]
[null,null,701.19299999999998,"CONDUIT SYSTEM-UNDERGROUND TELEPHONE","LS"]
[null,null,701.1721,"CONDUIT-FLEXIBLE METAL 1 in ","FT"]
[null,null,701.17210999999998,"CONDUIT-FLEXIBLE METAL 1 in ","LS"]
[null,null,701.17205000000001,"CONDUIT-FLEXIBLE METAL 1/2 in ","FT"]
[null,null,701.17205999999999,"CONDUIT-FLEXIBLE METAL 1/2 in ","LS"]
[null,null,701.17206999999996,"CONDUIT-FLEXIBLE METAL 3/4 in ","FT"]
[null,null,701.17208000000005,"CONDUIT-FLEXIBLE METAL 3/4 in ","LS"]
[null,null,701.17111999999997,"CONDUIT-RIGID PVC 1 ¼ in ","FT"]
[null,null,701.17110000000002,"CONDUIT-RIGID PVC 1 in ","FT"]
[null,null,701.17111,"CONDUIT-RIGID PVC 1 in ","LS"]
[null,null,701.17124999999999,"CONDUIT-RIGID PVC 2 ½ in","FT"]
[null,null,701.1712,"CONDUIT-RIGID PVC 2 in ","FT"]
[null,null,701.17120999999997,"CONDUIT-RIGID PVC 2 in ","LS"]
[null,null,701.17129999999997,"CONDUIT-RIGID PVC 3 in ","FT"]
[null,null,701.17130999999995,"CONDUIT-RIGID PVC 3 in ","LS"]
[null,null,701.17105000000004,"CONDUIT-RIGID PVC 3/4 in","FT"]
[null,null,701.17139999999995,"CONDUIT-RIGID PVC 4 in ","FT"]
[null,null,701.17141000000004,"CONDUIT-RIGID PVC 4 in ","LS"]
[null,null,701.17160000000001,"CONDUIT-RIGID PVC 6 in ","FT"]
[null,null,701.17160999999999,"CONDUIT-RIGID PVC 6 in ","LS"]
[null,null,701.17168000000004,"CONDUIT-RIGID PVC 8 in","FT"]
[null,null,701.17015000000004,"CONDUIT-RIGID STL 1 1/2 in ","FT"]
[null,null,701.17016000000001,"CONDUIT-RIGID STL 1 1/2 in ","LS"]
[null,null,701.17010000000005,"CONDUIT-RIGID STL 1 in ","FT"]
[null,null,701.17011000000002,"CONDUIT-RIGID STL 1 in ","LS"]
[null,null,701.17004999999995,"CONDUIT-RIGID STL 1/2 in ","FT"]
[null,null,701.17006000000003,"CONDUIT-RIGID STL 1/2 in ","LS"]
[null,null,701.17025000000001,"CONDUIT-RIGID STL 2 1/2 in","FT"]
[null,null,701.17020000000002,"CONDUIT-RIGID STL 2 in ","FT"]
[null,null,701.17021,"CONDUIT-RIGID STL 2 in ","LS"]
[null,null,701.1703,"CONDUIT-RIGID STL 3 in ","FT"]
[null,null,701.17030999999997,"CONDUIT-RIGID STL 3 in ","LS"]
[null,null,701.17007000000001,"CONDUIT-RIGID STL 3/4 in ","FT"]
[null,null,701.17007999999998,"CONDUIT-RIGID STL 3/4 in ","LS"]
[null,null,701.17039999999997,"CONDUIT-RIGID STL 4 in ","FT"]
[null,null,701.17040999999995,"CONDUIT-RIGID STL 4 in ","LS"]
[null,null,701.17042000000004,"CONDUIT-RIGID STL 6 in","FT"]
[null,null,701.40099999999995,"CONNECTOR KIT - FUSED I","EA"]
[null,null,701.40200000000004,"CONNECTOR KIT - FUSED Y","EA"]
[null,null,701.40300000000002,"CONNECTOR KIT - UNFUSED I","EA"]
[null,null,701.404,"CONNECTOR KIT - UNFUSED Y","EA"]
[null,"S",299.036,"CONTAMINATED EXCAVATION","CY"]
[null,"S",900.5,"CONTRACTOR MIX DESIGN (CONCRETE)","LS"]
[null,"S",900.91,"CONTRACTOR MIX DESIGN (PCCP)","LS"]
[null,"S",900.6,"CONTRACTOR QUALITY CONTROL (CONCRETE)","LS"]
[null,"S",900.92,"CONTRACTOR QUALITY CONTROL (PCCP)","LS"]
[null,"S",900.4,"CONTRACTOR QUALITY CONTROL PLAN (CONCRETE)","LS"]
[null,"S",900.9,"CONTRACTOR QUALITY CONTROL PLAN (PCCP)","LS"]
[null,null,215.01,"CONTRACTOR STORM WATER CONTROL","LS"]
[null,"S",105.09,"CONTRACTOR SURVEYING","MI"]
[null,null,105.09010000000001,"CONTRACTOR SURVEYING","LS"]
[null,null,106.05200000000001,"CONTRACTOR TESTING","LS"]
[null,"S",299.02005000000003,"CONTROLLED BLASTING","LS"]
[null,"S",299.02100000000002,"CONTROLLED BLASTING","FT"]
[null,"S",299.02199999999999,"CONTROLLED BLASTING TEST SHOTS","FT"]
[null,"S",199,"CONTROLS FOR LEAD PAINT REMOVAL","LS"]
[null,"S",699.02017999999998,"COPPER WATER LINE 1 1/2 in ","FT"]
[null,"S",699.02016000000003,"COPPER WATER LINE 1 in ","FT"]
[null,"S",699.02025000000003,"COPPER WATER LINE 2 1/2 in ","FT"]
[null,"S",699.02020000000005,"COPPER WATER LINE 2 in ","FT"]
[null,"S",699.02030000000002,"COPPER WATER LINE 3 in ","FT"]
[null,"S",699.02013999999997,"COPPER WATER LINE 3/4 in ","FT"]
[null,"S",699.0204,"COPPER WATER LINE 4 in ","FT"]
[null,"S",699.06034999999997,"CORPORATION STOPS 1 1/2 in ","EA"]
[null,"S",699.06029999999998,"CORPORATION STOPS 1 in","EA"]
[null,"S",699.06039999999996,"CORPORATION STOPS 2 in ","EA"]
[null,"S",699.06025,"CORPORATION STOPS 3/4 in ","EA"]
[null,null,606.01,"CORR BEAM GUARDRAIL","FT"]
[null,null,606.02,"CORR BEAM GUARDRAIL (SELF-OXIDIZING)","FT"]
[null,null,606.02020000000005,"CORR BEAM GUARDRAIL END ANCH TYPE A","EA"]
[null,null,606.03,"CORR BEAM GUARDRAIL END ANCH TYPE A (SELF-OXIDIZING)","EA"]
[null,null,606.02025000000003,"CORR BEAM GUARDRAIL END ANCH TYPE B","EA"]
[null,null,606.03004999999996,"CORR BEAM GUARDRAIL END ANCH TYPE B (SELF-OXIDIZING)","EA"]
[null,null,606.02030000000002,"CORR BEAM GUARDRAIL END ANCH TYPE C","EA"]
[null,null,606.03009999999995,"CORR BEAM GUARDRAIL END ANCH TYPE C (SELF-OXIDIZING)","EA"]
[null,null,606.02035000000001,"CORR BEAM GUARDRAIL END ANCH TYPE D","EA"]
[null,null,606.03015000000005,"CORR BEAM GUARDRAIL END ANCH TYPE D (SELF-OXIDIZING)","EA"]
[null,null,606.0204,"CORR BEAM GUARDRAIL END ANCH TYPE E","EA"]
[null,null,606.03020000000004,"CORR BEAM GUARDRAIL END ANCH TYPE E (SELF-OXIDIZING)","EA"]
[null,null,606.02044999999998,"CORR BEAM GUARDRAIL END ANCH TYPE F","EA"]
[null,null,606.03025000000002,"CORR BEAM GUARDRAIL END ANCH TYPE F (SELF-OXIDIZING)","EA"]
[null,"S",606.01009999999997,"CORR BEAM GUARDRAIL SPECIAL","FT"]
[null,null,606.01000999999997,"CORR BEAM MED BARRIER","FT"]
[null,null,606.01014999999995,"CORR BEAM MED BARRIER TERM","EA"]
[null,"S",612.10011999999995,"CORR STL ARCH CULVERT 12 ft ","FT"]
[null,null,612.00215000000003,"CORR STL SIPHON FE SECT 15 in ","EA"]
[null,null,612.00217999999995,"CORR STL SIPHON FE SECT 18 in ","EA"]
[null,null,612.00224000000003,"CORR STL SIPHON FE SECT 24 in ","EA"]
[null,null,612.00117999999998,"CORR STL SIPHON PIPE 18 in ","FT"]
[null,null,612.00124000000005,"CORR STL SIPHON PIPE 24 in ","FT"]
[null,null,108.03,"CPM SCHEDULE","LS"]
[null,"S",499.02044999999998,"CRACK AND SEAT CONC PVMT","SY"]
[null,"S",599.00084000000004,"CRACK REPAIR","HR"]
[null,null,403.0505,"CRACK SEAL (PLANT MIX)","LB"]
[null,null,403.05054999999999,"CRACK SEAL (PLANT MIX)","CF"]
[null,"S",417.06015000000002,"CRACK SEAL (PLANT MIX)","FT"]
[null,"S",417.06,"CRACK SEAL (PLANT MIX) < 3/4\"","FT"]
[null,"S",417.06009999999998,"CRACK SEAL (PLANT MIX) > 3/4\"","FT"]
[null,"S",403.05059999999997,"CRACK SURFACING (PLANT MIX)","CF"]
[null,"S",415.02017999999998,"CROSS-STITCHING (CONC PVMT)","EA"]
[null,null,301.01076,"CRUSHED BASE","SY"]
[null,null,301.01080000000002,"CRUSHED BASE","TON"]
[null,null,301.01085,"CRUSHED BASE","CY"]
[null,null,301.0104,"CRUSHED SUBBASE","TON"]
[null,null,301.01044999999999,"CRUSHED SUBBASE","CY"]
[null,null,301.01047,"CRUSHED SUBBASE","SY"]
[null,null,301.0102,"CRUSHER RUN SUBBASE","TON"]
[null,null,301.01029999999997,"CRUSHER RUN SUBBASE","CY"]
[null,null,301.01035000000002,"CRUSHER RUN SUBBASE","SY"]
[null,null,211.03315000000001,"CULVERT CLEANING","EA"]
[null,null,206.03299999999999,"CULVERT SUBEXCAVATION","CY"]
[null,null,412.01,"CURB (PLANT MIX)","FT"]
[null,null,609.10199999999998,"CURB AND GUTTER TYPE A","FT"]
[null,null,609.10299999999995,"CURB AND GUTTER TYPE B","FT"]
[null,null,609.10400000000004,"CURB AND GUTTER TYPE C","FT"]
[null,"S",299.024,"CUSHION BLASTING","FT"]
[null,null,617.01,"CUT-OFF WALL (CONC)","CY"]
[null,null,202.036,"CUTTING BIT PVMT","FT"]
[null,null,202.0361,"CUTTING CONCRETE","FT"]
[null,"S",799.72,"DASHED CENTERLINE STRIPING","MI"]
[null,"S",608.10699999999997,"DECORATIVE CONCRETE","SY"]
[null,"S",608.10704999999996,"DECORATIVE CONCRETE","SF"]
[null,"SD",607.72199999999998,"DEER RAMPS","EA"]
[null,null,702.50099999999998,"DELINEATORS, TYPE I","EA"]
[null,null,702.50199999999995,"DELINEATORS, TYPE II","EA"]
[null,null,702.50300000000004,"DELINEATORS, TYPE III","EA"]
[null,null,702.50400000000002,"DELINEATORS, TYPE IV","EA"]
[null,"D",702.50660000000005,"DELINEATORS, TYPE IX","EA"]
[null,null,702.505,"DELINEATORS, TYPE V","EA"]
[null,null,702.50599999999997,"DELINEATORS, TYPE VI","EA"]
[null,null,702.50649999999996,"DELINEATORS, TYPE VII","EA"]
[null,"D",702.50654999999995,"DELINEATORS, TYPE VIII","EA"]
[null,null,215.01009999999999,"DEPARTMENT STORM WATER CONTROL","$$"]
[null,null,608.10500000000002,"DITCH PAVING (CONC) ","SY"]
[null,null,608.10505000000001,"DITCH PAVING (CONC) ","SF"]
[null,"D",625.4,"DIVERSION BOX TYPE W","EA"]
[null,"D",625.40099999999995,"DIVERSION BOX TYPE X","EA"]
[null,"D",625.40200000000004,"DIVERSION BOX TYPE Y","EA"]
[null,"D",625.40300000000002,"DIVERSION BOX TYPE Z","EA"]
[null,null,609.10699999999997,"DOUBLE GUTTER","SY"]
[null,null,609.10709999999995,"DOUBLE GUTTER","SF"]
[null,"D",416.01074999999997,"DOWEL BAR RETROFIT ","EA"]
[null,"S",414.01069999999999,"DOWEL JOINTS","FT"]
[null,"S",599.00026000000003,"DOWELED ANCHOR JOINTS","FT"]
[null,null,506.01017999999999,"DRILLED SHAFT FOUNDATIONS 18 in ","FT"]
[null,null,506.01024000000001,"DRILLED SHAFT FOUNDATIONS 24 in ","FT"]
[null,null,506.01029999999997,"DRILLED SHAFT FOUNDATIONS 30 in","FT"]
[null,null,506.01035999999999,"DRILLED SHAFT FOUNDATIONS 36 in ","FT"]
[null,null,506.01042000000001,"DRILLED SHAFT FOUNDATIONS 42 in ","FT"]
[null,null,506.01047999999997,"DRILLED SHAFT FOUNDATIONS 48 in ","FT"]
[null,null,506.01053999999999,"DRILLED SHAFT FOUNDATIONS 54 in ","FT"]
[null,null,506.01060000000001,"DRILLED SHAFT FOUNDATIONS 60 in ","FT"]
[null,null,506.01065999999997,"DRILLED SHAFT FOUNDATIONS 66 in ","FT"]
[null,null,506.01071999999999,"DRILLED SHAFT FOUNDATIONS 72 in ","FT"]
[null,null,506.01078000000001,"DRILLED SHAFT FOUNDATIONS 78 in ","FT"]
[null,"S",699.06065000000001,"DRIP IRRIGATION SYSTEM","LS"]
[null,null,219.02500000000001,"DRIVEN ANCHORS","EA"]
[null,null,212.02099999999999,"DRY EXCAVATION","CY"]
[null,null,216.03899999999999,"DRY MULCH","TON"]
[null,"S",699.02003999999999,"DUCTILE IRON WATER LINE  4 in ","FT"]
[null,"S",699.02005999999994,"DUCTILE IRON WATER LINE  6 in ","FT"]
[null,"S",699.02008000000001,"DUCTILE IRON WATER LINE  8 in ","FT"]
[null,"S",699.02009999999996,"DUCTILE IRON WATER LINE 10 in ","FT"]
[null,"S",699.02012000000002,"DUCTILE IRON WATER LINE 12 in ","FT"]
[null,null,221.01,"DUST CONTROL AGENT","TON"]
[null,"S",299.01900000000001,"DYNAMIC COMPACTION DROP","EA"]
[null,"S",109.09,"DYNAMIC COMPACTION MOBILIZATION","LS"]
[null,"S",701.86,"DYNAMIC MESSAGE SIGN - BLANK OUT","EA"]
[null,"S",701.85005000000001,"DYNAMIC MESSAGE SIGN - OVERHEAD","EA"]
[null,"S",701.84005000000002,"DYNAMIC MESSAGE SIGN - SIDE MOUNT","EA"]
[null,"S",701.84,"DYNAMIC MESSAGE SIGN -2 LINE-CHARACTER MATRIX ","EA"]
[null,"S",701.85,"DYNAMIC MESSAGE SIGN -3 LINE-LINE MATRIX ","EA"]
[null,"S",701.89,"DYNAMIC MESSAGE SIGN SYSTEM","LS"]
[null,"S",701.89499999999998,"DYNAMIC MESSAGE SIGN-VARIABLE SPEED LIMIT","EA"]
[null,"S",701.89504999999997,"DYNAMIC MESSAGE SIGN-VARIABLE SPEED LIMIT (SOLAR)","EA"]
[null,"S",605.5,"EDGE DRAIN TYPE W","FT"]
[null,"S",605.50009999999997,"EDGE DRAIN TYPE X","FT"]
[null,"S",599.00027999999998,"ELASTOMERIC BEARING PADS","EA"]
[null,null,512.01049999999998,"ELASTOMERIC COMP JOINT SEAL","FT"]
[null,null,701.298,"ELECTRICAL CONDUCTORS","LS"]
[null,"S",701.29899999999998,"ELECTRICAL CONDUCTORS-TEMPORARY SIGNAL","LS"]
[null,null,701.83,"ELECTRICAL SYSTEM","LS"]
[null,"S",409.0308,"EMULSIFIED ASPHALT","TON"]
[null,"S",409.03084999999999,"EMULSIFIED ASPHALT MODIFIED","TON"]
[null,"S",409.03089999999997,"EMULSIFIED ASPHALT OVERSHOOT","TON"]
[null,"S",309.01,"EMULSION STABILIZED BASE","TON"]
[null,"S",399.00040000000001,"EMULSION STABILIZED BLENDED BASE","TON"]
[null,"S",399.00024000000002,"EMULSION STABILIZED FULL DEPTH RECLAMATION","SY"]
[null,null,607.90099999999995,"END PANELS","EA"]
[null,"SD",607.90499999999997,"END PANELS (DEER)","EA"]
[null,null,607.904,"END PANELS (INDUSTRIAL)","EA"]
[null,"SD",607.90599999999995,"END PANELS (SPECIAL)","EA"]
[null,null,607.90700000000004,"END PANELS (TEMPORARY)               DO NOT USE","EA"]
[null,"S",799.71820000000002,"EPOXY PAVEMENT LINE 12 in ","FT"]
[null,"S",799.71825000000001,"EPOXY PAVEMENT LINE 18 in ","FT"]
[null,"S",799.7183,"EPOXY PAVEMENT LINE 24 in ","FT"]
[null,"S",799.71810000000005,"EPOXY PAVEMENT LINE 4 in ","FT"]
[null,"S",799.71815000000004,"EPOXY PAVEMENT LINE 8 in ","FT"]
[null,"S",799.71804999999995,"EPOXY PAVEMENT MARKINGS","LS"]
[null,null,627.01,"EPOXY RESIN INJECTION","LS"]
[null,null,627.01000999999997,"EPOXY RESIN INJECTION","GAL"]
[null,null,627.01004999999998,"EPOXY RESIN INJECTION","FT"]
[null,null,215.03399999999999,"EROSION BALES","EA"]
[null,null,215.0341,"EROSION CONTROL AGENT","ACRE"]
[null,null,215.03415000000001,"EROSION CONTROL AGENT","TON"]
[null,null,216.03909999999999,"EROSION CONTROL BLANKET","SY"]
[null,null,614.01,"EROSION CONTROL CONCRETE","CY"]
[null,null,216.03919999999999,"EROSION CONTROL NETTING","SY"]
[null,null,210.0361,"EXCAVATOR","HR"]
[null,null,215.03402,"EXCELSIOR SEDIMENT LOG","FT"]
[null,"S",699.06074999999998,"EXPANDED POLYSTYRENE BLOCKS","CY"]
[null,"S",512.01022,"EXPANSION JOINT (ASPHALTIC)","FT"]
[null,"S",512.01012000000003,"EXPANSION JOINT (GLAND)","FT"]
[null,"S",512.01013,"EXPANSION JOINT (MODULAR)","FT"]
[null,"S",512.01011000000005,"EXPANSION JOINT (NOSED)","FT"]
[null,"S",512.01,"EXPANSION JOINT (REPAIR/MODIFICATION)","LS"]
[null,"SD",607.51504999999997,"FENCE (CONCRETE BLOCK NOISE BARRIER)","SY"]
[null,null,607.50400000000002,"FENCE BARRIER","FT"]
[null,"D",607.50199999999995,"FENCE BUCK AND POLE","FT"]
[null,"D",607.50210000000004,"FENCE CEDAR","FT"]
[null,"D",607.50099999999998,"FENCE DEER","FT"]
[null,null,607.40099999999995,"FENCE INDUSTRIAL 42 in","FT"]
[null,null,607.40200000000004,"FENCE INDUSTRIAL 48 in","FT"]
[null,null,607.40300000000002,"FENCE INDUSTRIAL 60 in","FT"]
[null,null,607.404,"FENCE INDUSTRIAL 72 in","FT"]
[null,null,607.40700000000004,"FENCE INDUSTRIAL 72 in (BW TOP) ","FT"]
[null,null,607.40499999999997,"FENCE INDUSTRIAL 84 in","FT"]
[null,null,607.40800000000002,"FENCE INDUSTRIAL 84 in (BW TOP) ","FT"]
[null,null,607.40599999999995,"FENCE INDUSTRIAL 96 in","FT"]
[null,null,607.40809999999999,"FENCE INDUSTRIAL 96 in (BW TOP) ","FT"]
[null,"SD",607.40899999999999,"FENCE INDUSTRIAL SPECIAL","FT"]
[null,"S",607.51509999999996,"FENCE POST","EA"]
[null,"S",607.50599999999997,"FENCE REPAIR","FT"]
[null,null,607.51099999999997,"FENCE TEMPORARY","FT"]
[null,null,607.30100000000004,"FENCE TYPE A (METAL POSTS)","FT"]
[null,null,607.20100000000002,"FENCE TYPE A (WOOD POSTS)","FT"]
[null,null,607.30200000000002,"FENCE TYPE B (METAL POSTS)","FT"]
[null,null,607.202,"FENCE TYPE B (WOOD POSTS)","FT"]
[null,null,607.303,"FENCE TYPE C (METAL POSTS)","FT"]
[null,null,607.20299999999997,"FENCE TYPE C (WOOD POSTS)","FT"]
[null,null,607.30399999999997,"FENCE TYPE D (METAL POSTS)","FT"]
[null,null,607.20399999999995,"FENCE TYPE D (WOOD POSTS)","FT"]
[null,null,607.30499999999995,"FENCE TYPE E (METAL POSTS)","FT"]
[null,null,607.20500000000004,"FENCE TYPE E (WOOD POSTS)","FT"]
[null,null,607.30600000000004,"FENCE TYPE F (METAL POSTS)","FT"]
[null,null,607.20600000000002,"FENCE TYPE F (WOOD POSTS)","FT"]
[null,null,607.30700000000002,"FENCE TYPE G (METAL POSTS)","FT"]
[null,null,607.20699999999999,"FENCE TYPE G (WOOD POSTS)","FT"]
[null,null,607.30799999999999,"FENCE TYPE H (METAL POSTS)","FT"]
[null,null,607.20799999999997,"FENCE TYPE H (WOOD POSTS)","FT"]
[null,null,607.10500000000002,"FENCE TYPE T","FT"]
[null,null,607.10599999999999,"FENCE TYPE U","FT"]
[null,null,607.10699999999997,"FENCE TYPE V","FT"]
[null,null,607.10900000000004,"FENCE TYPE W","FT"]
[null,null,607.10910000000001,"FENCE TYPE X","FT"]
[null,null,607.10919999999999,"FENCE TYPE Y","FT"]
[null,null,607.10929999999996,"FENCE TYPE Z","FT"]
[null,null,607.51,"FENCE-WING (METAL POSTS)","FT"]
[null,null,607.50900000000001,"FENCE-WING (WOOD POSTS)","FT"]
[null,"S",216.0318,"FERTILIZER SPECIAL","LB"]
[null,null,216.03120000000001,"FERTILIZER TYPE I ","LB"]
[null,null,216.03129999999999,"FERTILIZER TYPE II ","LB"]
[null,null,216.03135,"FERTILIZER TYPE III","LB"]
[null,null,216.03139999999999,"FERTILIZER TYPE IV ","LB"]
[null,null,216.03151,"FERTILIZER TYPE V","CY"]
[null,null,216.03149999999999,"FERTILIZER TYPE V ","TON"]
[null,null,216.0316,"FERTILIZER TYPE VI ","LB"]
[null,null,216.0317,"FERTILIZER TYPE VII ","LB"]
[null,"S",701.82,"FIBER OPTICS COMMUNICATIONS SYSTEM","LS"]
[null,"S",411.01015000000001,"FIBERGLASS-POLYESTER PAVING FABRIC","SY"]
[null,"S",499.03354999999999,"FIBERS","TON"]
[null,null,106.051,"FIELD LABORATORY ","EA"]
[null,null,511.04,"FILTER AGGREGATE","CY"]
[null,null,620.07095000000004,"FIRE HYDRANT","EA"]
[null,null,703.03099999999995,"FLAGGING","HR"]
[null,"SD",625.601,"FLAP GATE W","EA"]
[null,"SD",625.60199999999998,"FLAP GATE X","EA"]
[null,"SD",625.60299999999995,"FLAP GATE Y","EA"]
[null,"SD",625.60400000000004,"FLAP GATE Z","EA"]
[null,null,701.7,"FLASHING BEACON SYSTEM","LS"]
[null,"S",212.03925000000001,"FLEXIBLE COFFERDAM SYSTEM","FT"]
[null,"S",702.51,"FLEXIBLE DELINEATORS, TYPE I","EA"]
[null,"S",702.51009999999997,"FLEXIBLE DELINEATORS, TYPE II","EA"]
[null,"S",702.51020000000005,"FLEXIBLE DELINEATORS, TYPE III","EA"]
[null,"S",702.51030000000003,"FLEXIBLE DELINEATORS, TYPE IV","EA"]
[null,"S",702.5104,"FLEXIBLE DELINEATORS, TYPE V","EA"]
[null,"S",702.51049999999998,"FLEXIBLE DELINEATORS, TYPE VI","EA"]
[null,"S",702.20299999999997,"FLEXIBLE REFERENCE MARKERS","EA"]
[null,null,206.03100000000001,"FLOWABLE BACKFILL","CY"]
[null,"S",305.0102,"FLY ASH (CEMENT TREATED BASE)","TON"]
[null,"S",414.02,"FLY ASH (CONC PVMT)","TON"]
[null,null,409.02100000000002,"FOG SEAL","TON"]
[null,null,109.04,"FORCE ACCOUNT WORK","$$"]
[null,"S",219.04499999999999,"FRICTION ROCK BOLTS","EA"]
[null,"S",399.00020999999998,"FULL DEPTH RECLAMATION","SY"]
[null,"S",399.00026000000003,"FULL DEPTH RECLAMATION","CY"]
[null,null,511.01,"GABIONS","CY"]
[null,null,511.02,"GABIONS","SY"]
[null,"SD",625.70100000000002,"GATE VALVE W","EA"]
[null,"SD",625.702,"GATE VALVE X","EA"]
[null,"SD",625.70299999999997,"GATE VALVE Y","EA"]
[null,"SD",625.70399999999995,"GATE VALVE Z","EA"]
[null,"SD",607.72,"GATES DEER","EA"]
[null,null,607.70399999999995,"GATES GALV STL 10 ft ","EA"]
[null,null,607.70500000000004,"GATES GALV STL 12 ft ","EA"]
[null,null,607.70600000000002,"GATES GALV STL 14 ft ","EA"]
[null,null,607.70699999999999,"GATES GALV STL 16 ft ","EA"]
[null,null,607.70100000000002,"GATES GALV STL 4 ft  ","EA"]
[null,null,607.702,"GATES GALV STL 6 ft ","EA"]
[null,null,607.70299999999997,"GATES GALV STL 8 ft ","EA"]
[null,null,607.60900000000004,"GATES INDUSTRIAL- OVERHEAD SLIDE 12 ft ","EA"]
[null,null,607.61,"GATES INDUSTRIAL- OVERHEAD SLIDE 16 ft ","EA"]
[null,null,607.61099999999999,"GATES INDUSTRIAL- OVERHEAD SLIDE 20 ft ","EA"]
[null,null,607.61199999999997,"GATES INDUSTRIAL- OVERHEAD SLIDE 24 ft ","EA"]
[null,null,607.61300000000006,"GATES INDUSTRIAL- OVERHEAD SLIDE 30 ft ","EA"]
[null,null,607.60400000000004,"GATES INDUSTRIAL- SINGLE SWING 10 ft ","EA"]
[null,null,607.60500000000002,"GATES INDUSTRIAL- SINGLE SWING 12 ft ","EA"]
[null,null,607.60599999999999,"GATES INDUSTRIAL- SINGLE SWING 14 ft ","EA"]
[null,null,607.60699999999997,"GATES INDUSTRIAL- SINGLE SWING 16 ft ","EA"]
[null,null,607.60799999999995,"GATES INDUSTRIAL- SINGLE SWING 20 ft ","EA"]
[null,null,607.601,"GATES INDUSTRIAL- SINGLE SWING 4 ft ","EA"]
[null,null,607.60199999999998,"GATES INDUSTRIAL- SINGLE SWING 6 ft ","EA"]
[null,null,607.60299999999995,"GATES INDUSTRIAL- SINGLE SWING 8 ft ","EA"]
[null,null,607.61400000000003,"GATES INDUSTRIAL-ROLLING 12 ft ","EA"]
[null,null,607.61500000000001,"GATES INDUSTRIAL-ROLLING 14 ft ","EA"]
[null,null,607.61599999999999,"GATES INDUSTRIAL-ROLLING 16 ft","EA"]
[null,null,607.61699999999996,"GATES INDUSTRIAL-ROLLING 20 ft ","EA"]
[null,null,607.61800000000005,"GATES INDUSTRIAL-ROLLING 25 ft ","EA"]
[null,null,607.61301000000003,"GATES INDUSTRIAL-ROLLING 4 ft ","EA"]
[null,null,607.71,"GATES RAIL 10 ft ","EA"]
[null,null,607.71100000000001,"GATES RAIL 12 ft ","EA"]
[null,null,607.71199999999999,"GATES RAIL 14 ft ","EA"]
[null,null,607.71299999999997,"GATES RAIL 16 ft ","EA"]
[null,null,607.71400000000006,"GATES RAIL 18 ft","EA"]
[null,null,607.71500000000003,"GATES RAIL 20 ft","EA"]
[null,null,607.70708999999999,"GATES RAIL 4 ft ","EA"]
[null,null,607.70799999999997,"GATES RAIL 6 ft ","EA"]
[null,null,607.70899999999995,"GATES RAIL 8 ft ","EA"]
[null,"SD",607.721,"GATES SPECIAL","EA"]
[null,"S",217.01050000000001,"GEOCELL","SY"]
[null,"S",217.01044999999999,"GEOGRID","SY"]
[null,"S",299.03899999999999,"GEOTEXTILE BAG CURB","FT"]
[null,null,217.01,"GEOTEXTILE, DRAINAGE AND FILTRATION","SY"]
[null,null,217.0103,"GEOTEXTILE, EMB AND RETAINING WALL","SY"]
[null,null,217.01009999999999,"GEOTEXTILE, EROSION CONTROL","SY"]
[null,null,217.01025000000001,"GEOTEXTILE, MATERIAL SEPARATION (NON-WOVEN)","SY"]
[null,null,217.0102,"GEOTEXTILE, MATERIAL SEPARATION (WOVEN)","SY"]
[null,null,217.0104,"GEOTEXTILE, SILT FENCE","SY"]
[null," ",217.01043000000001,"GEOTEXTILE, SUBGRADE REINFORCEMENT","SY"]
[null,null,411.01010000000002,"GLASS FIBER REINFORCED PAVING FABRIC","SY"]
[null,"S",311.01010000000002,"GRAVEL FOR ARRESTOR BED","CY"]
[null,null,605.09,"GRAVEL FOR DRAINS","CY"]
[null,null,605.09010000000001,"GRAVEL FOR DRAINS","TON"]
[null,null,415.02017000000001,"GRIND/TEXTURE CONC PVMT","SY"]
[null,"S",415.0204,"GROOVING CONCRETE PAVEMENT","SY"]
[null,null,701.21349999999995,"GROUND ROD","EA"]
[null,"S",513.01499999999999,"GROUT","LS"]
[null,"S",513.01509999999996,"GROUT","CY"]
[null,null,219.03,"GROUTED ANCHORS","EA"]
[null,"S",511.08,"GROUTED RIPRAP","CY"]
[null,null,511.05,"HAND-PLACED RIPRAP","CY"]
[null,null,204.03100000000001,"HAUL ","CYMI"]
[null,null,204.03200000000001,"HAUL ","TMI"]
[null,null,205.03100000000001,"HAUL ROAD MAINTENANCE/RESTORATION","$$"]
[null,"S",603.66017999999997,"HDPE LINER PIPE 18 in","FT"]
[null,"S",603.66024000000004,"HDPE LINER PIPE 24 in","FT"]
[null,"S",603.66030000000001,"HDPE LINER PIPE 30 in","FT"]
[null,"S",603.66031999999996,"HDPE LINER PIPE 32 in","FT"]
[null,"S",603.66035999999997,"HDPE LINER PIPE 36 in","FT"]
[null,"S",603.66042000000004,"HDPE LINER PIPE 42 in","FT"]
[null,"S",603.66048000000001,"HDPE LINER PIPE 48 in","FT"]
[null,"S",603.66053999999997,"HDPE LINER PIPE 54 in","FT"]
[null,"S",603.66060000000004,"HDPE LINER PIPE 60 in","FT"]
[null,"S",603.66066000000001,"HDPE LINER PIPE 66 in","FT"]
[null,"S",603.66084000000001,"HDPE LINER PIPE 84 in","FT"]
[null,"S",603.66071999999997,"HDPE LINER PIPE72 in","FT"]
[null,"S",603.66078000000005,"HDPE LINER PIPE78 in","FT"]
[null,null,617.01009999999997,"HEADWALL (CONC)","CY"]
[null,"S",217.01079999999999,"HIGH DENSITY POLYURETHANE FILL","LB"]
[null,"S",217.01075,"HIGH DENSITY STRESS RELIEF INTERLAYER","FT"]
[null,"S",404.01001000000002,"HIGH PERFORMANCE WEARING COURSE","TON"]
[null,"S",513.01300000000003,"HIGH STRENGTH CONCRETE","LS"]
[null,"S",701.24419999999998,"HIGHMAST LIGHTING CONTROL CABINET","EA"]
[null,"S",701.2441,"HIGHMAST LOWERING DEVICES","EA"]
[null,"S",701.24429999999995,"HIGHMAST LUMINAIRE","EA"]
[null,"S",701.81600000000003,"HIGHWAY ADVISORY RADIO SYSTEM","LS"]
[null,null,611.101,"HIGHWAY MONUMENTS","EA"]
[null,"S",415.02024999999998,"HOLE DRILLING (CONC PVMT)","EA"]
[null,"S",605.50019999999995,"HORIZONTAL DRAINS","FT"]
[null,"S",499.03332999999998,"HOT IN-PLACE RECYCLING","SY"]
[null,null,401.02,"HOT PLANT MIX ","TON"]
[null,null,401.02055000000001,"HOT PLANT MIX  APPROACHES","TON"]
[null,"S",401.0213,"HOT PLANT MIX  MAINT","TON"]
[null,"S",401.02135000000004,"HOT PLANT MIX  MAINT","SY"]
[null,null,401.03309999999999,"HOT PLANT MIX (RECYCLE)","TON"]
[null,null,401.02021000000002,"HOT PLANT MIX (SUPERPAVE)                                      (DO NOT USE) ","TON"]
[null,null,401.03320000000002,"HOT PLANT MIX APPROACHES (RECYCLE) ","TON"]
[null,null,401.02030000000002,"HOT PLANT MIX LEVELING","TON"]
[null,null,401.03314999999998,"HOT PLANT MIX LEVELING (RECYCLE)","TON"]
[null,null,401.02026000000001,"HOT PLANT MIX LEVELING (SUPERPAVE)                  (DO NOT USE)","TON"]
[null,null,413.01,"HYDRATED LIME","TON"]
[null,null,214.01,"HYDRATED LIME ( SUBGRADE)","TON"]
[null,null,216.036,"HYDRAULIC MULCHING","TON"]
[null,null,216.035,"HYDRAULIC SEEDING","TON"]
[null,"S",703.10199999999998,"IMPACT ATTENUATOR","EA"]
[null,"S",703.10209999999995,"IMPACT ATTENUATOR","LS"]
[null,"S",703.10400000000004,"IMPACT ATTENUATOR REPLACEMENT KIT","EA"]
[null,"S",703.10299999999995,"IMPACT ATTENUATOR REPLACEMENTS","LS"]
[null,"S",703.10749999999996,"IMPACT SAND BARREL-1400 LBS","EA"]
[null,"S",703.10500000000002,"IMPACT SAND BARREL-200 LBS","EA"]
[null,"S",703.10799999999995,"IMPACT SAND BARREL-2100 LBS","EA"]
[null,"S",703.10599999999999,"IMPACT SAND BARREL-400 LBS","EA"]
[null,"S",703.10699999999997,"IMPACT SAND BARREL-700 LBS","EA"]
[null,null,218.01,"IMPERMEABLE PLASTIC MEMBRANE","SY"]
[null,null,999.07,"INCENTIVE FOR COMPLETION PAY","$$"]
[null,"D",625.22,"INLET  ADJUSTMENT","EA"]
[null,null,625.20100000000002,"INLET TYPE A","EA"]
[null,null,625.202,"INLET TYPE B","EA"]
[null,null,625.20299999999997,"INLET TYPE C","EA"]
[null,null,625.20399999999995,"INLET TYPE D","EA"]
[null,null,625.20500000000004,"INLET TYPE E","EA"]
[null,"D",625.20501000000002,"INLET TYPE F","EA"]
[null,null,625.30100000000004,"INLET TYPE M1","EA"]
[null,"D",625.20501999999999,"INLET TYPE T","EA"]
[null,"D",625.20502999999997,"INLET TYPE U","EA"]
[null,"D",625.20504000000005,"INLET TYPE V","EA"]
[null,"D",625.20505000000003,"INLET TYPE W","EA"]
[null,"D",625.20600000000002,"INLET TYPE X","EA"]
[null,"D",625.20699999999999,"INLET TYPE Y","EA"]
[null,"D",625.20799999999997,"INLET TYPE Z","EA"]
[null,null,701.24400000000003,"INSTALL LIGHTING POLE","EA"]
[null,null,702.30319999999995,"INSTALL SIGN PANELS, ALUMINUM ","SF"]
[null,null,702.30309999999997,"INSTALL SIGN PANELS, PLYWOOD ","SF"]
[null,"S",299.03500000000003,"INSTALLING SETTLEMENT PLATFORM ","EA"]
[null,"S",701.81,"INTELLIGENT TRANSPORTATION SYSTEM","LS"]
[null,"S",702.30700000000002,"INTERNALLY LIGHTED SIGN 10 ft-6 in X 13 ft-6 in ","EA"]
[null,"S",702.30799999999999,"INTERNALLY LIGHTED SIGN 10 ft-6 in X 15 ft-6 in ","EA"]
[null,"S",699.06065999999998,"IRRIGATION SYSTEM","LS"]
[null,"S",701.81299999999999,"ITS COMMUNICATION SYSTEM","LS"]
[null,"S",603.71054000000004,"JACKED PIPE","FT"]
[null,"S",512.01022999999998,"JOINT SEALS","FT"]
[null,"S",216.03970000000001,"LANDSCAPING WORK","LS"]
[null,"S",999.14,"LANE RENTAL","$$"]
[null,"S",799.76,"LED-BLANKOUT SIGN","EA"]
[null,null,701.31799999999998,"LIGHTING CABLE 3 CONDUCTOR #12 AWG","FT"]
[null,"S",408.0111,"LIQUID ASPHALT (MAINT)","TON"]
[null,null,210.03700000000001,"LOADER","HR"]
[null,null,701.58,"LOOP DETECTOR SEALANT","GAL"]
[null,null,701.33,"LOOP DETECTOR SHIELDED LEAD-IN CABLE","FT"]
[null,null,701.32,"LOOP DETECTOR WIRE","FT"]
[null,null,701.52200000000005,"LOUVERED BACKPLATE 12-12-12","EA"]
[null,null,701.52300000000002,"LOUVERED BACKPLATE 12-12-12-12-12","EA"]
[null,null,701.52099999999996,"LOUVERED BACKPLATE 12-8-8","EA"]
[null,null,613.01,"LTX EMULSION PAINT (CONC)","LS"]
[null,null,511.06,"MACHINE-PLACED RIPRAP","CY"]
[null,"S",310.03095000000002,"MAINT STOCKPILE (PLANT MIXED)","TON"]
[null,"S",310.03097000000002,"MAINT STOCKPILE (PLANT MIXED)","CY"]
[null,null,310.02010000000001,"MAINT STOCKPILE TYPE A 1/2 in ","TON"]
[null,null,310.02015,"MAINT STOCKPILE TYPE A 1/2 in ","CY"]
[null,null,310.02,"MAINT STOCKPILE TYPE A 3/8 in ","TON"]
[null,null,310.02005000000003,"MAINT STOCKPILE TYPE A 3/8 in ","CY"]
[null,null,310.0204,"MAINT STOCKPILE TYPE B 1/2 in ","TON"]
[null,null,310.02044999999998,"MAINT STOCKPILE TYPE B 1/2 in ","CY"]
[null,null,310.02042,"MAINT STOCKPILE TYPE B 1/2 in (SALT MIXED)","TON"]
[null,null,310.02046999999999,"MAINT STOCKPILE TYPE B 1/2 in (SALT MIXED)","CY"]
[null,null,310.02050000000003,"MAINT STOCKPILE TYPE B 3/4 in ","TON"]
[null,null,310.02051999999998,"MAINT STOCKPILE TYPE B 3/4 in ","CY"]
[null,null,310.02051,"MAINT STOCKPILE TYPE B 3/4 in (SALT MIXED)","TON"]
[null,null,310.02053999999998,"MAINT STOCKPILE TYPE B 3/4 in (SALT MIXED)","CY"]
[null,null,310.02019999999999,"MAINT STOCKPILE TYPE B 3/8 in ","TON"]
[null,null,310.02024999999998,"MAINT STOCKPILE TYPE B 3/8 in ","CY"]
[null,null,310.02030000000002,"MAINT STOCKPILE TYPE B 3/8 in  (SALT MIXED)","TON"]
[null,null,310.02035000000001,"MAINT STOCKPILE TYPE B 3/8 in  (SALT MIXED)","CY"]
[null,null,310.02055000000001,"MAINT STOCKPILE TYPE B NO. 4 ","TON"]
[null,null,310.02057000000002,"MAINT STOCKPILE TYPE B NO. 4 ","CY"]
[null,null,310.02055999999999,"MAINT STOCKPILE TYPE B NO. 4 (SALT MIXED)","TON"]
[null,null,310.02058,"MAINT STOCKPILE TYPE B NO. 4 (SALT MIXED)","CY"]
[null,null,310.0206,"MAINT STOCKPILE TYPE B NO. 4 MOD ","TON"]
[null,null,310.02064999999999,"MAINT STOCKPILE TYPE B NO. 4 MOD ","CY"]
[null,null,310.02062999999998,"MAINT STOCKPILE TYPE B NO. 4 MOD (SALT MIXED)","TON"]
[null,null,310.02069999999998,"MAINT STOCKPILE TYPE B NO. 4 MOD (SALT MIXED)","CY"]
[null,null,310.02999999999997,"MAINT STOCKPILE TYPE C","TON"]
[null,null,310.03005000000002,"MAINT STOCKPILE TYPE C","CY"]
[null,null,310.0301,"MAINT STOCKPILE TYPE C (SALT MIXED)","TON"]
[null,null,310.03014999999999,"MAINT STOCKPILE TYPE C (SALT MIXED)","CY"]
[null,null,625.12,"MANHOLE  ADJUSTMENT","EA"]
[null,null,625.101,"MANHOLE TYPE A","EA"]
[null,null,625.10199999999998,"MANHOLE TYPE B","EA"]
[null,null,625.10299999999995,"MANHOLE TYPE C","EA"]
[null,null,625.10400000000004,"MANHOLE TYPE D","EA"]
[null,null,625.10500000000002,"MANHOLE TYPE E","EA"]
[null,null,625.10599999999999,"MANHOLE TYPE F","EA"]
[null,"D",625.10699999999997,"MANHOLE TYPE X","EA"]
[null,"D",625.10799999999995,"MANHOLE TYPE Y","EA"]
[null,"D",625.10900000000004,"MANHOLE TYPE Z","EA"]
[null,"SD",625.12009999999998,"MANHOLE VAULT TYPE A","EA"]
[null,"SD",625.12019999999995,"MANHOLE VAULT TYPE B","EA"]
[null,"SD",625.12030000000004,"MANHOLE VAULT TYPE C","EA"]
[null,"SD",625.12040000000002,"MANHOLE VAULT TYPE D","EA"]
[null,null,701.53099999999995,"MAST ARM FRAMEWORK","EA"]
[null,null,514.00004999999999,"MECHANICAL SPLICES","LS"]
[null,null,514.00009999999997,"MECHANICAL SPLICES","EA"]
[null,"S",299.017,"MECHANICALLY STABILIZED EARTHWALL","SF"]
[null,null,505.06,"MEDIAN BARRIER 32 in","FT"]
[null,null,505.06004999999999,"MEDIAN BARRIER 42 in ","FT"]
[null,null,608.10400000000004,"MEDIAN PAVING (CONC)","SY"]
[null,null,608.10405000000003,"MEDIAN PAVING (CONC)","SF"]
[null,null,412.01069999999999,"MEDIAN PAVING (PLANT MIX)","SY"]
[null,null,610.101,"METAL DRAIN INLET","EA"]
[null,null,610.10199999999998,"METAL DRAIN PIPE","FT"]
[null,"S",599.00044000000003,"METHYL METHACRYLATE CONCRETE OVERLAY","SY"]
[null,"S",606.01020000000005,"MGS GUARDRAIL","FT"]
[null,"S",606.01030000000003,"MGS GUARDRAIL (WEATHERING STEEL)","FT"]
[null,"S",606.01025000000004,"MGS GUARDRAIL SPECIAL","FT"]
[null,"S",606.01035000000002,"MGS MEDIAN BARRIER","FT"]
[null,"S",606.02049999999997,"MGS TERMINAL TYPE I","EA"]
[null,"S",606.02059999999994,"MGS TERMINAL TYPE I (WEATHERING STEEL)","EA"]
[null,"S",606.02054999999996,"MGS TERMINAL TYPE II","EA"]
[null,"S",606.02065000000005,"MGS TERMINAL TYPE II (WEATHERING STEEL)","EA"]
[null,null,701.57,"MICRO LOOP DETECTOR ","EA"]
[null,null,410.01,"MICROSURFACING (AGGREGATE)","TON"]
[null,null,410.01004999999998,"MICROSURFACING (EMULSIFIED ASPHALT)","TON"]
[null,null,701.57005000000004,"MICROWAVE DETECTOR","EA"]
[null,null,202.03317000000001,"MILLING CONCRETE ","SY"]
[null,null,202.03317999999999,"MILLING CONCRETE ","CY"]
[null,null,202.03305,"MILLING PLANT MIX","SY"]
[null,null,202.03309999999999,"MILLING PLANT MIX","CY"]
[null,null,202.03315000000001,"MILLING PLANT MIX","TON"]
[null,"S",702.50800000000004,"MIRRORED DEER DELINEATOR","EA"]
[null,null,999.27,"MISCELLANEOUS ITEMS","LS"]
[null,null,109.08,"MOBILIZATION","LS"]
[null,null,701.24800000000005,"MODIFY LIGHTING POLE","EA"]
[null,null,701.46799999999996,"MODIFY SIGNAL CONTROLLER CABINET","EA"]
[null,null,701.21799999999996,"MODIFYSERVICE POINT","EA"]
[null,null,210.03299999999999,"MOTOR GRADER","HR"]
[null,null,203.024,"MUCK EXCAVATION","CY"]
[null,null,216.0394,"MULCH TACK TYPE AR","ACRE"]
[null,null,216.03952000000001,"MULCH TACK TYPE GU","ACRE"]
[null,null,216.0395,"MULCH TACK TYPE MC","ACRE"]
[null,null,213.03110000000001,"OVERBURDEN PLACING","CY"]
[null,null,213.03100000000001,"OVERBURDEN REMOVAL","CY"]
[null,null,701.75,"OVERHEAD SIGN LIGHTING SYSTEM","LS"]
[null,null,701.64099999999996,"OVERHEAD SIGN LUMINAIRE","EA"]
[null,"S",702.09109999999998,"OVERHEAD SIGN STRUCTURE","LS"]
[null,"S",701.81799999999998,"OVERHEIGHT DETECTION SYSTEM","LS"]
[null,null,516.42020000000002,"PAINT REPAIR-BRIDGE RAILING","LS"]
[null,null,516.42025000000001,"PAINT REPAIR-BRIDGE RAILING","FT"]
[null,null,516.4203,"PAINT REPAIR-STEEL PILING","LS"]
[null,null,516.42034999999998,"PAINT REPAIR-STEEL PILING","SF"]
[null,null,516.42010000000005,"PAINT REPAIR-STRUCTURAL STEEL","LS"]
[null,null,516.42012,"PAINT REPAIR-STRUCTURAL STEEL","SF"]
[null,"S",299.01400000000001,"PANEL ERECTION (STEEL)","SF"]
[null,"SD",625.80005000000006,"PARSHALL FLUME 12 X 15 in ","EA"]
[null,"SD",625.80100000000004,"PARSHALL FLUME 18 X 18 in ","EA"]
[null,"SD",625.80200000000002,"PARSHALL FLUME 24 X 36 in ","EA"]
[null,"SD",625.803,"PARSHALL FLUME 36 X 30 in ","EA"]
[null,"SD",625.79999999999995,"PARSHALL FLUME 9 X 15 in","EA"]
[null,"S",799.60500000000002,"PAVEMENT LINE 12 in ","FT"]
[null,"S",799.60599999999999,"PAVEMENT LINE 18 in","FT"]
[null,"S",799.60699999999997,"PAVEMENT LINE 24 In","FT"]
[null,"S",799.60299999999995,"PAVEMENT LINE 4 in ","FT"]
[null,"S",799.60400000000004,"PAVEMENT LINE 8 in ","FT"]
[null,"S",799.74900000000002,"PAVEMENT MARKING REMOVAL","SF"]
[null,"S",799.74,"PAVEMENT MARKINGS FOR WORDS AND SYMBOLS","SF"]
[null,"S",216.07599999999999,"PAVERS","SF"]
[null,null,411.01,"PAVING FABRIC","SY"]
[null,null,701.59100000000001,"PED DETECTOR","EA"]
[null,null,701.59199999999998,"PED INSTRUCTION SIGN (9X12)","EA"]
[null,null,701.51099999999997,"PED SIGNAL INDICATION","EA"]
[null,null,503.01400000000001,"PEDESTRIAN RAILING","FT"]
[null,null,503.01414999999997,"PEDESTRIAN RAILING MODIFICATION","LS"]
[null,null,503.01420000000002,"PEDESTRIAN RAILING MODIFICATION","FT"]
[null,"S",503.01420999999999,"PEDESTRIAN SAFETY RAILING","FT"]
[null,"S",415.02055000000001,"PENETRANT SEALANT (CONCRETE)","SY"]
[null,"S",799.74699999999996,"PERMANENT APRON MARKING","SF"]
[null,"S",799.74800000000005,"PERMANENT BLASTPAD MARKING","SF"]
[null,"S",799.745,"PERMANENT RUNWAY MARKING","SF"]
[null,"S",799.74599999999998,"PERMANENT TAXIWAY MARKING","SF"]
[null,null,212.03899999999999,"PERVIOUS BACKFILL MATERIAL","CY"]
[null,null,212.03909999999999,"PERVIOUS BACKFILL MATERIAL","TON"]
[null,null,504.0401,"PILE SPLICES","EA"]
[null,null,603.01009999999997,"PIPE 10 in","FT"]
[null,null,603.01102000000003,"PIPE 102 in  ","FT"]
[null,null,603.01107999999999,"PIPE 108 in  ","FT"]
[null,null,603.01113999999995,"PIPE 114 in  ","FT"]
[null,null,603.01012000000003,"PIPE 12 in ","FT"]
[null,null,603.01120000000003,"PIPE 120 in  ","FT"]
[null,null,603.01143999999999,"PIPE 144 in  ","FT"]
[null,null,603.01014999999995,"PIPE 15 in  ","FT"]
[null,null,603.01017999999999,"PIPE 18 in  ","FT"]
[null,null,603.01023999999995,"PIPE 24 in  ","FT"]
[null,null,603.01030000000003,"PIPE 30 in  ","FT"]
[null,null,603.01035999999999,"PIPE 36 in  ","FT"]
[null,null,603.01041999999995,"PIPE 42 in  ","FT"]
[null,null,603.01048000000003,"PIPE 48 in  ","FT"]
[null,null,603.01053999999999,"PIPE 54 in  ","FT"]
[null,null,603.01005999999995,"PIPE 6 in","FT"]
[null,null,603.01059999999995,"PIPE 60 in  ","FT"]
[null,null,603.01066000000003,"PIPE 66 in  ","FT"]
[null,null,603.01071999999999,"PIPE 72 in  ","FT"]
[null,null,603.01077999999995,"PIPE 78 in  ","FT"]
[null,null,603.01084000000003,"PIPE 84 in  ","FT"]
[null,null,603.01089999999999,"PIPE 90 in  ","FT"]
[null,null,603.01095999999995,"PIPE 96 in  ","FT"]
[null,null,603.12017000000003,"PIPE ARCH  FE SECT 17 X 13 in ","EA"]
[null,null,603.12021000000004,"PIPE ARCH  FE SECT 21 X 15 in ","EA"]
[null,null,603.12023999999997,"PIPE ARCH  FE SECT 24 X 18 in ","EA"]
[null,null,603.12027999999998,"PIPE ARCH  FE SECT 28 X 20 in ","EA"]
[null,null,603.12035000000003,"PIPE ARCH  FE SECT 35 X 24 in ","EA"]
[null,null,603.12041999999997,"PIPE ARCH  FE SECT 42 X 29 in ","EA"]
[null,null,603.12049000000002,"PIPE ARCH  FE SECT 49 X 33 in ","EA"]
[null,null,603.12057000000004,"PIPE ARCH  FE SECT 57 X 38 in ","EA"]
[null,null,603.12063999999998,"PIPE ARCH  FE SECT 64 X 43 in ","EA"]
[null,null,603.12071000000003,"PIPE ARCH  FE SECT 71 X 47 in ","EA"]
[null,null,603.12072999999998,"PIPE ARCH  FE SECT 73 X 55 in ","EA"]
[null,null,603.12081000000001,"PIPE ARCH  FE SECT 81 X 59 in ","EA"]
[null,null,603.10103000000004,"PIPE ARCH 103 X 71 in ","FT"]
[null,null,603.10112000000004,"PIPE ARCH 112 X 75 in ","FT"]
[null,null,603.10117000000002,"PIPE ARCH 117 X 79 in ","FT"]
[null,null,603.10127999999997,"PIPE ARCH 128 X 83 in ","FT"]
[null,null,603.10136999999997,"PIPE ARCH 137 X 87 in ","FT"]
[null,null,603.10141999999996,"PIPE ARCH 142 X 91 in ","FT"]
[null,null,603.10017000000005,"PIPE ARCH 17 X 13 in ","FT"]
[null,null,603.10020999999995,"PIPE ARCH 21 X 15 in ","FT"]
[null,null,603.10023999999999,"PIPE ARCH 24 X 18 in ","FT"]
[null,null,603.10028,"PIPE ARCH 28 X 20 in ","FT"]
[null,null,603.10035000000005,"PIPE ARCH 35 X 24 in ","FT"]
[null,null,603.10041999999999,"PIPE ARCH 42 X 29 in ","FT"]
[null,null,603.10049000000004,"PIPE ARCH 49 X 33 in ","FT"]
[null,null,603.10056999999995,"PIPE ARCH 57 X 38 in ","FT"]
[null,null,603.10064,"PIPE ARCH 64 X 43 in ","FT"]
[null,null,603.10071000000005,"PIPE ARCH 71 X 47 in ","FT"]
[null,null,603.10073,"PIPE ARCH 73 X 55 in ","FT"]
[null,null,603.10081000000002,"PIPE ARCH 81 X 59 in ","FT"]
[null,null,603.10086999999999,"PIPE ARCH 87 X 63 in ","FT"]
[null,null,603.10095000000001,"PIPE ARCH 95 X 67 in ","FT"]
[null,null,603.71010000000001,"PIPE COLLARS","CY"]
[null,null,603.03012000000001,"PIPE FE SECT 12 in  ","EA"]
[null,null,603.03015000000005,"PIPE FE SECT 15 in  ","EA"]
[null,null,603.03017999999997,"PIPE FE SECT 18 in  ","EA"]
[null,null,603.03024000000005,"PIPE FE SECT 24 in  ","EA"]
[null,null,603.03030000000001,"PIPE FE SECT 30 in  ","EA"]
[null,null,603.03035999999997,"PIPE FE SECT 36 in  ","EA"]
[null,null,603.03042000000005,"PIPE FE SECT 42 in  ","EA"]
[null,null,603.03048000000001,"PIPE FE SECT 48 in  ","EA"]
[null,null,603.03053999999997,"PIPE FE SECT 54 in  ","EA"]
[null,null,603.03060000000005,"PIPE FE SECT 60 in  ","EA"]
[null,null,603.03066000000001,"PIPE FE SECT 66 in  ","EA"]
[null,null,603.03071999999997,"PIPE FE SECT 72 in  ","EA"]
[null,null,603.03078000000005,"PIPE FE SECT 78 in ","EA"]
[null,null,603.03084000000001,"PIPE FE SECT 84 in  ","EA"]
[null,null,603.03089999999997,"PIPE FE SECT 90 in  ","EA"]
[null,null,301.01,"PIT RUN SUBBASE","TON"]
[null,null,301.01010000000002,"PIT RUN SUBBASE","CY"]
[null,null,301.01015000000001,"PIT RUN SUBBASE","SY"]
[null,"S",409.03077999999999,"PLACING STOCKPILED CHIP SEAL AGGREGATE","SY"]
[null,"S",399.00004999999999,"PLACING STOCKPILED MATERIAL","TON"]
[null,"S",399.00009999999997,"PLACING STOCKPILED MATERIAL","CY"]
[null,"S",401.02019999999999,"PLANT MIX  ","TON"]
[null,"S",401.0206,"PLANT MIX  APPROACHES ","TON"]
[null,null,406.03005000000002,"PLANT MIX (COMMERCIAL)","TON"]
[null,"S",399.00015000000002,"PLANT MIX BIT BASE","TON"]
[null,"S",401.02026999999998,"PLANT MIX LEVELING","TON"]
[null,"S",401.02005000000003,"PLANT MIX PAVEMENT RCI","TON"]
[null,null,404.01,"PLANT MIX WEARING COURSE","TON"]
[null,"S",699.08004000000005,"PLASTIC SEWER  PIPE  4 in ","FT"]
[null,"S",699.08006,"PLASTIC SEWER  PIPE  6 in ","FT"]
[null,"S",699.08007999999995,"PLASTIC SEWER  PIPE  8 in ","FT"]
[null,"S",699.08010000000002,"PLASTIC SEWER  PIPE 10 in ","FT"]
[null,"S",699.08011999999997,"PLASTIC SEWER  PIPE 12 in ","FT"]
[null,"S",699.08015,"PLASTIC SEWER  PIPE 15 in ","FT"]
[null,"S",699.08018000000004,"PLASTIC SEWER  PIPE 18 in ","FT"]
[null,"S",699.08024,"PLASTIC SEWER  PIPE 24 in ","FT"]
[null,null,612.00311999999997,"PLASTIC SIPHON PIPE 12 in ","FT"]
[null,null,612.00315000000001,"PLASTIC SIPHON PIPE 15 in ","FT"]
[null,null,612.00318000000004,"PLASTIC SIPHON PIPE 18 in ","FT"]
[null,null,612.00324000000001,"PLASTIC SIPHON PIPE 24 in ","FT"]
[null,null,612.00329999999997,"PLASTIC SIPHON PIPE 30 in ","FT"]
[null,null,703.03421000000003,"PLASTIC WATER BARRIER","FT"]
[null,"S",299.01799999999997,"PNEUMATICALLY APPLIED MORTAR","SY"]
[null,"S",411.01015999999998,"POLY-FIBER MATRIX PAVING FABRIC","SY"]
[null,"S",699.0607,"POLYSTYRENE INSULATION","SY"]
[null,"S",699.03015000000005,"POLYVINYL CHLORIDE PRESSURE PIPE  1 1/2 in ","FT"]
[null,"S",699.03012000000001,"POLYVINYL CHLORIDE PRESSURE PIPE  1 1/4 in ","FT"]
[null,"S",699.03009999999995,"POLYVINYL CHLORIDE PRESSURE PIPE  1 in ","FT"]
[null,"S",699.03025000000002,"POLYVINYL CHLORIDE PRESSURE PIPE  2 1/2 in ","FT"]
[null,"S",699.03020000000004,"POLYVINYL CHLORIDE PRESSURE PIPE  2 in ","FT"]
[null,"S",699.03030000000001,"POLYVINYL CHLORIDE PRESSURE PIPE  3 in ","FT"]
[null,"S",699.03000999999995,"POLYVINYL CHLORIDE PRESSURE PIPE  3/4 in ","FT"]
[null,"S",699.03039999999999,"POLYVINYL CHLORIDE PRESSURE PIPE  4 in ","FT"]
[null,"S",699.03060000000005,"POLYVINYL CHLORIDE PRESSURE PIPE  6 in ","FT"]
[null,"S",699.0308,"POLYVINYL CHLORIDE PRESSURE PIPE  8 in ","FT"]
[null,"S",699.03080999999997,"POLYVINYL CHLORIDE PRESSURE PIPE 10 in ","FT"]
[null,"S",699.03081999999995,"POLYVINYL CHLORIDE PRESSURE PIPE 12 in ","FT"]
[null,"S",699.03084000000001,"POLYVINYL CHLORIDE PRESSURE PIPE 14 in ","FT"]
[null,"S",699.03084999999999,"POLYVINYL CHLORIDE PRESSURE PIPE 15 in ","FT"]
[null,"S",699.03085999999996,"POLYVINYL CHLORIDE PRESSURE PIPE 16 in ","FT"]
[null,"S",699.03089999999997,"POLYVINYL CHLORIDE PRESSURE PIPE 18 in ","FT"]
[null,"S",699.03094999999996,"POLYVINYL CHLORIDE PRESSURE PIPE 24 in ","FT"]
[null,"S",699.03099999999995,"POLYVINYL CHLORIDE PRESSURE PIPE 30 in ","FT"]
[null,"S",630.01009999999997,"POND LINER SYSTEM","SY"]
[null,"S",701.82500000000005,"PORT OF ENTRY MANAGEMENT SYSTEM","LS"]
[null,"S",703.03510000000006,"PORTABLE TRAFFIC SIGNAL SYSTEM","LS"]
[null,"S",703.03205000000003,"PORTABLE VARIABLE MESSAGE SIGN","LS"]
[null,"S",703.03210000000001,"PORTABLE VARIABLE MESSAGE SIGN","EA"]
[null,"S",305.01010000000002,"PORTLAND CEMENT (CEMENT TREATED BASE)","TON"]
[null,"S",414.01029999999997,"PORTLAND CEMENT (CONC PVMT)","TON"]
[null,null,701.53200000000004,"POST TOP FRAMEWORK","EA"]
[null,"S",599.00112000000001,"POST-TENSIONED PRECAST CONCRETE RETAINING WALLS","LS"]
[null,"S",599.00109999999995,"POST-TENSIONING CONCRETE","LS"]
[null,null,502.11009999999999,"PRECAST BOX CULVERTS 10 X 10 ft ","FT"]
[null,null,502.11011999999999,"PRECAST BOX CULVERTS 10 X 12 ft ","FT"]
[null," ",502.11004000000003,"PRECAST BOX CULVERTS 10 X 4 ft ","FT"]
[null,null,502.11005,"PRECAST BOX CULVERTS 10 X 5 ft ","FT"]
[null,null,502.11005999999998,"PRECAST BOX CULVERTS 10 X 6 ft ","FT"]
[null,null,502.11007000000001,"PRECAST BOX CULVERTS 10 X 7 ft ","FT"]
[null,null,502.11007999999998,"PRECAST BOX CULVERTS 10 X 8 ft ","FT"]
[null,null,502.11009000000001,"PRECAST BOX CULVERTS 10 X 9 ft ","FT"]
[null,null,502.1121,"PRECAST BOX CULVERTS 12 X 10 ft ","FT"]
[null,null,502.11210999999997,"PRECAST BOX CULVERTS 12 X 11 ft ","FT"]
[null,null,502.11212,"PRECAST BOX CULVERTS 12 X 12 ft ","FT"]
[null,null,502.11203,"PRECAST BOX CULVERTS 12 X 3 ft ","FT"]
[null,null,502.11203999999998,"PRECAST BOX CULVERTS 12 X 4 ft ","FT"]
[null,null,502.11205000000001,"PRECAST BOX CULVERTS 12 X 5 ft ","FT"]
[null,null,502.11205999999999,"PRECAST BOX CULVERTS 12 X 6 ft ","FT"]
[null,null,502.11207000000002,"PRECAST BOX CULVERTS 12 X 7 ft ","FT"]
[null,null,502.11207999999999,"PRECAST BOX CULVERTS 12 X 8 ft ","FT"]
[null,null,502.11209000000002,"PRECAST BOX CULVERTS 12 X 9 ft ","FT"]
[null,null,502.14210000000003,"PRECAST BOX CULVERTS 14 X 10 ft ","FT"]
[null,null,502.14213999999998,"PRECAST BOX CULVERTS 14 x 14 ft","FT"]
[null,null,502.14204999999998,"PRECAST BOX CULVERTS 14 X 5 ft","FT"]
[null,null,502.14206000000001,"PRECAST BOX CULVERTS 14 X 6 ft","FT"]
[null,null,502.14206999999999,"PRECAST BOX CULVERTS 14 X 7 ft ","FT"]
[null,null,502.16014999999999,"PRECAST BOX CULVERTS 16 X 14.5 ft","FT"]
[null,null,502.12009999999998,"PRECAST BOX CULVERTS 20 X 10 ft ","FT"]
[null,null,502.12011999999999,"PRECAST BOX CULVERTS 20 X 12 ft ","FT"]
[null,null,502.12004999999999,"PRECAST BOX CULVERTS 20 X 5 ft","FT"]
[null,null,502.12007,"PRECAST BOX CULVERTS 20 X 7 ft","FT"]
[null,null,502.12007999999997,"PRECAST BOX CULVERTS 20 X 8 ft","FT"]
[null,null,502.01402999999999,"PRECAST BOX CULVERTS 4 X 3 ft ","FT"]
[null,null,502.01503000000002,"PRECAST BOX CULVERTS 5 X 3 ft","FT"]
[null,null,502.01504999999997,"PRECAST BOX CULVERTS 5 X 5 ft","FT"]
[null,null,502.01603,"PRECAST BOX CULVERTS 6 X 3 ft","FT"]
[null,null,502.01603999999998,"PRECAST BOX CULVERTS 6 X 4 ft ","FT"]
[null,null,502.01605000000001,"PRECAST BOX CULVERTS 6 X 5 ft ","FT"]
[null,null,502.01605999999998,"PRECAST BOX CULVERTS 6 X 6 ft ","FT"]
[null,null,502.01702999999998,"PRECAST BOX CULVERTS 7 X 3 ft ","FT"]
[null,null,502.01704000000001,"PRECAST BOX CULVERTS 7 X 4 ft ","FT"]
[null,null,502.01704999999998,"PRECAST BOX CULVERTS 7 X 5 ft ","FT"]
[null,null,502.01706000000001,"PRECAST BOX CULVERTS 7 X 6 ft ","FT"]
[null,null,502.01706999999999,"PRECAST BOX CULVERTS 7 X 7 ft ","FT"]
[null,null,502.01803000000001,"PRECAST BOX CULVERTS 8 X 3 ft ","FT"]
[null,null,502.01803999999998,"PRECAST BOX CULVERTS 8 X 4 ft ","FT"]
[null,null,502.01805000000002,"PRECAST BOX CULVERTS 8 X 5 ft ","FT"]
[null,null,502.01805999999999,"PRECAST BOX CULVERTS 8 X 6 ft ","FT"]
[null,null,502.01807000000002,"PRECAST BOX CULVERTS 8 X 7 ft ","FT"]
[null,null,502.01808,"PRECAST BOX CULVERTS 8 X 8 ft ","FT"]
[null,null,502.01904000000002,"PRECAST BOX CULVERTS 9 X 4 ft ","FT"]
[null,null,502.01904999999999,"PRECAST BOX CULVERTS 9 X 5 ft ","FT"]
[null,null,502.01906000000002,"PRECAST BOX CULVERTS 9 X 6 ft ","FT"]
[null,null,502.01907,"PRECAST BOX CULVERTS 9 X 7 ft ","FT"]
[null,null,502.01907999999997,"PRECAST BOX CULVERTS 9 X 8 ft ","FT"]
[null,null,502.01909000000001,"PRECAST BOX CULVERTS 9 X 9 ft ","FT"]
[null,"S",502.15012000000002,"PRECAST CONCRETE ARCH CULVERT 12 ft","FT"]
[null,null,502.01,"PRECAST CONCRETE MEMBERS","LS"]
[null,"S",599.00001999999995,"PRECAST WALL COMPONENT SYSTEM","SF"]
[null,"S",599,"PRECAST WALL COMPONENTS","SF"]
[null,null,504.04,"PREDRILLED HOLES","FT"]
[null,null,701.56,"PREFAB LOOP DETECTOR","EA"]
[null,"S",605.29999999999995,"PREFABRICATED SHEET DRAIN","SF"]
[null,"S",799.71199999999999,"PREFORMED PAVEMENT LINE 12 in ","FT"]
[null,"S",799.71799999999996,"PREFORMED PAVEMENT LINE 18 in ","FT"]
[null,"S",799.71803999999997,"PREFORMED PAVEMENT LINE 24 in","FT"]
[null,"S",799.70399999999995,"PREFORMED PAVEMENT LINE 4 in ","FT"]
[null,"S",799.70600000000002,"PREFORMED PAVEMENT LINE 6 in ","FT"]
[null,"S",799.70699999999999,"PREFORMED PAVEMENT LINE 7 in ","FT"]
[null,"S",799.70799999999997,"PREFORMED PAVEMENT LINE 8 in ","FT"]
[null,"S",799.702,"PREFORMED PAVEMENT MARKINGS","SF"]
[null,"S",799.73,"PREFORMED PAVEMENT MARKINGS FOR WORDS AND SYMBOLS","LS"]
[null,"S",299.02300000000002,"PRESPLITTING","FT"]
[null,null,502.50035000000003,"PRESTRESSED PRECAST CONC BULB T 35 in ","FT"]
[null,null,502.50044000000003,"PRESTRESSED PRECAST CONC BULB T 44 in ","FT"]
[null,null,502.50047000000001,"PRESTRESSED PRECAST CONC BULB T 47 in ","FT"]
[null,null,502.50056000000001,"PRESTRESSED PRECAST CONC BULB T 56 in ","FT"]
[null,null,502.50094000000001,"PRESTRESSED PRECAST CONC BULB T 94 in","FT"]
[null,null,502.40028000000001,"PRESTRESSED PRECAST CONC I GIRDER 28 in ","FT"]
[null,null,502.40035999999998,"PRESTRESSED PRECAST CONC I GIRDER 36 in ","FT"]
[null,null,502.40039999999999,"PRESTRESSED PRECAST CONC I GIRDER 40 in ","FT"]
[null,null,502.40044999999998,"PRESTRESSED PRECAST CONC I GIRDER 45 in ","FT"]
[null,null,502.40053999999998,"PRESTRESSED PRECAST CONC I GIRDER 54 in ","FT"]
[null,null,502.40062999999998,"PRESTRESSED PRECAST CONC I GIRDER 63 in ","FT"]
[null,null,502.40071999999998,"PRESTRESSED PRECAST CONC I GIRDER 72 in ","FT"]
[null,null,502.40080999999998,"PRESTRESSED PRECAST CONC I GIRDER 81 in ","FT"]
[null,null,502.60016000000002,"PRESTRESSED PRECAST CONC TRI-DECK 16 in ","FT"]
[null,null,502.60027000000002,"PRESTRESSED PRECAST CONC TRI-DECK 27 in ","FT"]
[null,"S",502.70026999999999,"PRESTRESSED PRECAST CONCRETE BOX GIRDER 27 in","LS"]
[null,"S",502.70030000000003,"PRESTRESSED PRECAST CONCRETE BOX GIRDER 30 in","LS"]
[null,null,408.01,"PRIME COAT","TON"]
[null,null,214.01009999999999,"PROCESSING (LIME TREATED SUBGRADE)","FT"]
[null,null,214.0103,"PROCESSING (LIME TREATED SUBGRADE)","SY"]
[null,null,214.0102,"PROCESSING (LIME TREATED SUBGRADE) ","STA"]
[null,null,202.03319999999999,"PROFILE MILLING PLANT MIX","SY"]
[null,null,202.03325000000001,"PROFILE MILLING PLANT MIX","TON"]
[null,null,202.0333,"PROFILE MILLING PLANT MIX","CY"]
[null,"S",414.01076,"PROFILOGRAPH","EA"]
[null,"S",599.00030000000004,"PTFE SLIDE BEARINGS","EA"]
[null,null,701.20100000000002,"PULL BOX TYPE A","EA"]
[null,null,701.202,"PULL BOX TYPE B","EA"]
[null,null,701.20299999999997,"PULL BOX TYPE S","EA"]
[null,"S",603.65015000000005,"PVC LINER PIPE 15 in  ","FT"]
[null,"S",603.65017999999998,"PVC LINER PIPE 18 in  ","FT"]
[null,"S",603.65021000000002,"PVC LINER PIPE 21 in  ","FT"]
[null,"S",603.65024000000005,"PVC LINER PIPE 24 in  ","FT"]
[null,"S",603.65030000000002,"PVC LINER PIPE 30 in  ","FT"]
[null,"S",603.65035999999998,"PVC LINER PIPE 36 in  ","FT"]
[null,"S",603.65042000000005,"PVC LINER PIPE 42 in  ","FT"]
[null,"S",603.65048000000002,"PVC LINER PIPE 48 in  ","FT"]
[null,"S",603.65053999999998,"PVC LINER PIPE 54 in  ","FT"]
[null,"S",603.65060000000005,"PVC LINER PIPE 60 in  ","FT"]
[null,"S",603.65071999999998,"PVC LINER PIPE 72 in  ","FT"]
[null,null,999.03,"QUALITY ASSURANCE ASPHALT CONTENT","$$"]
[null,null,999.02,"QUALITY ASSURANCE DENSITY","$$"]
[null,null,999.01,"QUALITY ASSURANCE GRADATION","$$"]
[null,null,999.13009999999997,"QUALITY ASSURANCE PCCP","$$"]
[null,null,999.12,"QUALITY ASSURANCE PGAB","$$"]
[null,null,999.04,"QUALITY ASSURANCE RIDEABILITY","$$"]
[null,null,999.13,"QUALITY ASSURANCE STRUCTURAL CONCRETE","$$"]
[null,null,701.36500000000001,"RADAR DETECTOR CABLE","FT"]
[null,"S",799.75,"RAILROAD CROSSING PAVEMENT MARKING","EA"]
[null,"S",900.93,"RAILROAD FLAGGING","DAY"]
[null,"S",107.07,"RAILROAD INSURANCE","LS"]
[null,null,618.10405000000003,"RC STOCK PASS 48 X 60 in ","FT"]
[null,null,618.10406,"RC STOCK PASS 48 X 72 in ","FT"]
[null,null,618.10506999999996,"RC STOCK PASS 60 X 84 in ","FT"]
[null,null,618.10707000000002,"RC STOCK PASS 91 X 91 in ","FT"]
[null,null,618.20405000000005,"RC STOCK PASS FE SECT 48 X 60 in ","EA"]
[null,null,618.20406000000003,"RC STOCK PASS FE SECT 48 X 72 in ","EA"]
[null,null,618.20506999999998,"RC STOCK PASS FE SECT 60 X 84 in ","EA"]
[null,null,618.20707000000004,"RC STOCK PASS FE SECT 91 X 91 in","EA"]
[null,null,603.20101999999997,"RCP 102 in  ","FT"]
[null,null,603.20108000000005,"RCP 108 in  ","FT"]
[null,null,603.20011999999997,"RCP 12 in  ","FT"]
[null,null,603.20119999999997,"RCP 120 in  ","FT"]
[null,null,603.20015000000001,"RCP 15 in  ","FT"]
[null,null,603.20018000000005,"RCP 18 in  ","FT"]
[null,null,603.20020999999997,"RCP 21 in  ","FT"]
[null,null,603.20024000000001,"RCP 24 in  ","FT"]
[null,null,603.20029999999997,"RCP 30 in  ","FT"]
[null,null,603.20036000000005,"RCP 36 in  ","FT"]
[null,null,603.20042000000001,"RCP 42 in  ","FT"]
[null,null,603.20047999999997,"RCP 48 in  ","FT"]
[null,null,603.20054000000005,"RCP 54 in  ","FT"]
[null,null,603.20060000000001,"RCP 60 in  ","FT"]
[null,null,603.20065999999997,"RCP 66 in  ","FT"]
[null,null,603.20072000000005,"RCP 72 in  ","FT"]
[null,null,603.20078000000001,"RCP 78 in  ","FT"]
[null,null,603.20083999999997,"RCP 84 in  ","FT"]
[null,null,603.20090000000005,"RCP 90 in  ","FT"]
[null,null,603.20096000000001,"RCP 96 in  ","FT"]
[null,null,603.30101999999999,"RCP ARCH 102 X 62 in","FT"]
[null,null,603.30121999999994,"RCP ARCH 122 X 78 in","FT"]
[null,null,603.30154000000005,"RCP ARCH 154 X 97 in  ","FT"]
[null,null,603.30021999999997,"RCP ARCH 22 X 14 in  ","FT"]
[null,null,603.30029000000002,"RCP ARCH 29 X 18 in  ","FT"]
[null,null,603.30035999999996,"RCP ARCH 36 X 23 in  ","FT"]
[null,null,603.30043999999998,"RCP ARCH 44 X 27 in  ","FT"]
[null,null,603.30051000000003,"RCP ARCH 51 X 31 in  ","FT"]
[null,null,603.30059000000006,"RCP ARCH 59 X 36 in  ","FT"]
[null,null,603.30065000000002,"RCP ARCH 65 X 40 in  ","FT"]
[null,null,603.30073000000004,"RCP ARCH 73 X 45 in  ","FT"]
[null,null,603.30088000000001,"RCP ARCH 88 X 54 in  ","FT"]
[null,null,603.32101999999998,"RCP ARCH FE SECT 102 X 62 in","EA"]
[null,null,603.32021999999995,"RCP ARCH FE SECT 22 X 14 in  ","EA"]
[null,null,603.32029,"RCP ARCH FE SECT 29 X 18 in  ","EA"]
[null,null,603.32036000000005,"RCP ARCH FE SECT 36 X 23 in  ","EA"]
[null,null,603.32043999999996,"RCP ARCH FE SECT 44 X 27 in  ","EA"]
[null,null,603.32051000000001,"RCP ARCH FE SECT 51 X 31 in  ","EA"]
[null,null,603.32059000000004,"RCP ARCH FE SECT 59 X 36 in  ","EA"]
[null,null,603.32065,"RCP ARCH FE SECT 65 X 40 in  ","EA"]
[null,null,603.32073000000003,"RCP ARCH FE SECT 73 X 45 in  ","EA"]
[null,null,603.32087999999999,"RCP ARCH FE SECT 88 X 54 in  ","EA"]
[null,null,603.40106000000003,"RCP ELLIPTICAL 106 X 68 in  ","FT"]
[null,null,603.40112999999997,"RCP ELLIPTICAL 113 X 72 in  ","FT"]
[null,null,603.40120999999999,"RCP ELLIPTICAL 121 X 77 in  ","FT"]
[null,null,603.40128000000004,"RCP ELLIPTICAL 128 X 82 in  ","FT"]
[null,null,603.40135999999995,"RCP ELLIPTICAL 136 X 87 in  ","FT"]
[null,null,603.40143,"RCP ELLIPTICAL 143 X 92 in  ","FT"]
[null,null,603.40151000000003,"RCP ELLIPTICAL 151 X 97 in  ","FT"]
[null,null,603.40022999999997,"RCP ELLIPTICAL 23 X 14 in  ","FT"]
[null,null,603.40030000000002,"RCP ELLIPTICAL 30 X 19 in  ","FT"]
[null,null,603.40034000000003,"RCP ELLIPTICAL 34 X 22 in  ","FT"]
[null,null,603.40038000000004,"RCP ELLIPTICAL 38 X 24 in  ","FT"]
[null,null,603.40042000000005,"RCP ELLIPTICAL 42 X 27 in  ","FT"]
[null,null,603.40044999999998,"RCP ELLIPTICAL 45 X 29 in  ","FT"]
[null,null,603.40048999999999,"RCP ELLIPTICAL 49 X 32 in  ","FT"]
[null,null,603.40053,"RCP ELLIPTICAL 53 X 34 in  ","FT"]
[null,null,603.40060000000005,"RCP ELLIPTICAL 60 X 38 in  ","FT"]
[null,null,603.40067999999997,"RCP ELLIPTICAL 68 X 43 in  ","FT"]
[null,null,603.40075999999999,"RCP ELLIPTICAL 76 X 48 in  ","FT"]
[null,null,603.40083000000004,"RCP ELLIPTICAL 83 X 53 in  ","FT"]
[null,null,603.40090999999995,"RCP ELLIPTICAL 91 X 58 in  ","FT"]
[null,null,603.40098,"RCP ELLIPTICAL 98 X 63 in  ","FT"]
[null,null,603.41022999999996,"RCP ELLIPTICAL FE SECT 23 X 14 in  ","EA"]
[null,null,603.41030000000001,"RCP ELLIPTICAL FE SECT 30 X 19 in  ","EA"]
[null,null,603.41038000000003,"RCP ELLIPTICAL FE SECT 38 X 24 in  ","EA"]
[null,null,603.41044999999997,"RCP ELLIPTICAL FE SECT 45 X 29 in  ","EA"]
[null,null,603.41048999999998,"RCP ELLIPTICAL FE SECT 49 X 32 in  ","EA"]
[null,null,603.41052999999999,"RCP ELLIPTICAL FE SECT 53 X 34 in  ","EA"]
[null,null,603.41060000000004,"RCP ELLIPTICAL FE SECT 60 X 38 in  ","EA"]
[null,null,603.41067999999996,"RCP ELLIPTICAL FE SECT 68 X 43 in  ","EA"]
[null,null,603.41075999999998,"RCP ELLIPTICAL FE SECT 76 X 48 in  ","EA"]
[null,null,603.41083000000003,"RCP ELLIPTICAL FE SECT 83 X 53 in  ","EA"]
[null,null,603.22011999999995,"RCP FE SECT 12 in  ","EA"]
[null,null,603.22014999999999,"RCP FE SECT 15 in  ","EA"]
[null,null,603.22018000000003,"RCP FE SECT 18 in  ","EA"]
[null,null,603.22023999999999,"RCP FE SECT 24 in  ","EA"]
[null,null,603.22029999999995,"RCP FE SECT 30 in  ","EA"]
[null,null,603.22036000000003,"RCP FE SECT 36 in  ","EA"]
[null,null,603.22041999999999,"RCP FE SECT 42 in  ","EA"]
[null,null,603.22047999999995,"RCP FE SECT 48 in  ","EA"]
[null,null,603.22054000000003,"RCP FE SECT 54 in  ","EA"]
[null,null,603.22059999999999,"RCP FE SECT 60 in  ","EA"]
[null,null,603.22065999999995,"RCP FE SECT 66 in  ","EA"]
[null,null,603.22072000000003,"RCP FE SECT 72 in  ","EA"]
[null,null,603.22077999999999,"RCP FE SECT 78 in  ","EA"]
[null,null,603.22083999999995,"RCP FE SECT 84 in  ","EA"]
[null,null,603.22090000000003,"RCP FE SECT 90 in  ","EA"]
[null,null,612.00414999999998,"RCP SIPHON 15 in","FT"]
[null,null,612.00418000000002,"RCP SIPHON 18 in","FT"]
[null,null,612.00423999999998,"RCP SIPHON 24 in","FT"]
[null,null,612.00429999999994,"RCP SIPHON 30 in","FT"]
[null,null,612.00436000000002,"RCP SIPHON 36 in","FT"]
[null,null,612.00441999999998,"RCP SIPHON 42 in","FT"]
[null,null,612.00465999999994,"RCP SIPHON 66 in","FT"]
[null,null,612.00514999999996,"RCP SIPHON FE SECT 15 in","EA"]
[null,null,612.00518,"RCP SIPHON FE SECT 18 in","EA"]
[null,null,612.00523999999996,"RCP SIPHON FE SECT 24 in","EA"]
[null,null,612.00530000000003,"RCP SIPHON FE SECT 30 in","EA"]
[null,null,612.00536,"RCP SIPHON FE SECT 36 in","EA"]
[null,"S",499.03357,"RECLAIMED ASPHALT PAVEMENT","TON"]
[null,"S",499.03358000000003,"RECLAIMED ASPHALT PAVEMENT","CY"]
[null,"S",499.03046000000006,"RECLAIMED ASPHALT PAVEMENT WIDENING","CY"]
[null,"S",414.01065,"RECYCLED CONCRETE PVMT","SY"]
[null,"S",414.01062999999999,"RECYCLED CONCRETE PVMT (10 in) ","SY"]
[null,"S",414.01064000000002,"RECYCLED CONCRETE PVMT (11.5 in) ","SY"]
[null,"S",301.01085999999998,"RECYCLED CRUSHED BASE","CY"]
[null,"S",301.01087000000001,"RECYCLED CRUSHED BASE","TON"]
[null,"S",399.00020000000001,"RECYCLED PLANT MIX BIT BASE","TON"]
[null,"S",699.05111999999997,"REDUCERS 12 in X 10 in ","EA"]
[null,null,702.202,"REFERENCE MARKER PANELS","EA"]
[null,null,702.20100000000002,"REFERENCE MARKERS","EA"]
[null,null,507.01,"REINFORCED CONC APPROACH SLABS","SY"]
[null,null,508.01,"REINFORCED CONC SLOPE PAVING","SY"]
[null,"S",299.01499999999999,"REINFORCED EARTH BACKFILL MATERIAL","CY"]
[null,null,514.00014999999996,"REINFORCING STEEL","LS"]
[null,null,514.00019999999995,"REINFORCING STEEL","LB"]
[null,null,514.00025000000005,"REINFORCING STEEL (COATED)","LS"]
[null,null,514.00030000000004,"REINFORCING STEEL (COATED)","LB"]
[null,null,603.70010000000002,"RELAYING PIPE ","FT"]
[null,null,603.70101999999997,"RELAYING PIPE 102 in ","FT"]
[null,null,603.70108000000005,"RELAYING PIPE 108 in  ","FT"]
[null,null,603.70114000000001,"RELAYING PIPE 114 in  ","FT"]
[null,null,603.70011999999997,"RELAYING PIPE 12 in  ","FT"]
[null,null,603.70119999999997,"RELAYING PIPE 120 in  ","FT"]
[null,null,603.70015000000001,"RELAYING PIPE 15 in  ","FT"]
[null,null,603.70018000000005,"RELAYING PIPE 18 in  ","FT"]
[null,null,603.70024000000001,"RELAYING PIPE 24 in  ","FT"]
[null,null,603.70029999999997,"RELAYING PIPE 30 in   ","FT"]
[null,null,603.70036000000005,"RELAYING PIPE 36 in  ","FT"]
[null,null,603.70042000000001,"RELAYING PIPE 42 in  ","FT"]
[null,null,603.70047999999997,"RELAYING PIPE 48 in  ","FT"]
[null,null,603.70054000000005,"RELAYING PIPE 54 in  ","FT"]
[null,null,603.70060000000001,"RELAYING PIPE 60 in  ","FT"]
[null,null,603.70065999999997,"RELAYING PIPE 66 in  ","FT"]
[null,null,603.70072000000005,"RELAYING PIPE 72 in  ","FT"]
[null,null,603.70078000000001,"RELAYING PIPE 78 in  ","FT"]
[null,null,603.70083999999997,"RELAYING PIPE 84 in  ","FT"]
[null,null,603.70090000000005,"RELAYING PIPE 90 in  ","FT"]
[null,null,603.70096000000001,"RELAYING PIPE 96 in  ","FT"]
[null,"S",701.81200000000001,"REMOTE CAMERA SYSTEM","LS"]
[null,null,202.03434999999999,"REMOVAL OF BIT CURB","FT"]
[null,null,202.03251,"REMOVAL OF BRIDGE RAIL","FT"]
[null,null,202.03139999999999,"REMOVAL OF CATTLE GUARDS","EA"]
[null,null,202.03460000000001,"REMOVAL OF CONCRETE","LS"]
[null,null,202.03465,"REMOVAL OF CONCRETE","CY"]
[null,null,202.03469999999999,"REMOVAL OF CONCRETE","SY"]
[null,null,202.03174999999999,"REMOVAL OF CONCRETE BARRIER","FT"]
[null,null,202.03229999999999,"REMOVAL OF CONCRETE BRIDGES","EA"]
[null,null,202.03475,"REMOVAL OF CONCRETE MEDIAN","SY"]
[null,null,202.03476000000001,"REMOVAL OF CONCRETE MEDIAN","LS"]
[null,null,202.03477000000001,"REMOVAL OF CONCRETE MEDIAN","CY"]
[null,null,202.03415000000001,"REMOVAL OF CONCRETE PAVEMENT","SY"]
[null,null,202.03416000000001,"REMOVAL OF CONCRETE PAVEMENT","CY"]
[null,null,202.03416999999999,"REMOVAL OF CONCRETE PAVEMENT","LS"]
[null,null,202.0342,"REMOVAL OF CRUSHED BASE","TON"]
[null,null,202.03422,"REMOVAL OF CRUSHED BASE","CY"]
[null,null,202.03424999999999,"REMOVAL OF CRUSHED BASE","SY"]
[null,null,202.03440000000001,"REMOVAL OF CURB","FT"]
[null,null,202.03444999999999,"REMOVAL OF CURB AND GUTTER","FT"]
[null,null,202.03450000000001,"REMOVAL OF DOUBLE GUTTER","FT"]
[null,null,202.03455,"REMOVAL OF DOUBLE GUTTER","SY"]
[null,null,202.03205,"REMOVAL OF FENCE","FT"]
[null,null,202.0317,"REMOVAL OF GUARDRAIL","FT"]
[null,null,202.03165000000001,"REMOVAL OF GUARDRAIL AND BARRIER (DO NOT USE)","FT"]
[null,null,202.03295,"REMOVAL OF INLETS","EA"]
[null,null,202.03290000000001,"REMOVAL OF MANHOLES","EA"]
[null,"S",202.03417999999999,"REMOVAL OF METAL BACKER ROD","FT"]
[null,null,202.03252000000001,"REMOVAL OF PEDESTRIAN RAIL","FT"]
[null,null,202.0326,"REMOVAL OF PIPE ","FT"]
[null,null,202.03270000000001,"REMOVAL OF PIPE ","EA"]
[null,null,202.03280000000001,"REMOVAL OF PIPE FE SECTION","EA"]
[null,null,202.0325,"REMOVAL OF RC BOX CULVERTS","LS"]
[null,null,202.0343,"REMOVAL OF SIDEWALK","SY"]
[null,null,202.03431,"REMOVAL OF SIDEWALK","FT"]
[null,null,202.03129999999999,"REMOVAL OF SIGN STRUCTURES","LS"]
[null,null,202.03120000000001,"REMOVAL OF SIGNS","LS"]
[null,null,202.03149999999999,"REMOVAL OF SNOW FENCE","FT"]
[null,null,202.03155000000001,"REMOVAL OF SNOW FENCE PANELS","EA"]
[null,null,202.03210000000001,"REMOVAL OF STEEL BRIDGES","EA"]
[null,null,202.03299999999999,"REMOVAL OF STORM SEWER","FT"]
[null,null,202.03300999999999,"REMOVAL OF STORM SEWER","LS"]
[null,null,202.03100000000001,"REMOVAL OF STRUCTURES AND OBSTRUCTIONS","LS"]
[null,null,202.03399999999999,"REMOVAL OF SURFACING","SY"]
[null,null,202.03405000000001,"REMOVAL OF SURFACING","CY"]
[null,null,202.0341,"REMOVAL OF SURFACING","TON"]
[null,null,202.03219999999999,"REMOVAL OF TIMBER BRIDGES","EA"]
[null,null,701.58299999999997,"REMOVE AND REINSTALL DETECTOR","EA"]
[null,"S",299.03910000000002,"REMOVE AND REPLACE TOPSOIL","MI"]
[null,"S",299.03800000000001,"REMOVE AND RESET HISTORICAL MARKER","LS"]
[null,null,701.17600000000004,"REMOVE CONDUIT","FT"]
[null,null,701.17610000000002,"REMOVE CONDUIT","LS"]
[null,null,701.19600000000003,"REMOVE CONDUIT SYSTEM","LS"]
[null,null,701.53599999999994,"REMOVE FRAMEWORK","EA"]
[null,null,701.24599999999998,"REMOVE LIGHTING POLE","EA"]
[null,null,701.64599999999996,"REMOVE OVERHEAD SIGN LUMINAIRE","EA"]
[null,null,701.51599999999996,"REMOVE PED SIGNAL INDICATION","EA"]
[null,null,701.25599999999997,"REMOVE POLE FOUNDATION","EA"]
[null,null,701.20600000000002,"REMOVE PULL BOX","EA"]
[null,null,701.63599999999997,"REMOVE REST AREA LUMINAIRE","EA"]
[null,null,701.62599999999998,"REMOVE ROADWAY LUMINAIRE","EA"]
[null,null,701.21600000000001,"REMOVE SERVICE POINT","EA"]
[null,null,701.45600000000002,"REMOVE SIGNAL CONTROLLER","EA"]
[null,null,701.476,"REMOVE SIGNAL CONTROLLER AUX EQP","LS"]
[null,null,701.46600000000001,"REMOVE SIGNAL CONTROLLER CABINET","EA"]
[null,null,701.50599999999997,"REMOVE SIGNAL INDICATION","EA"]
[null,null,701.29600000000005,"REMOVE SINGLE CONDUCTOR WIRE","FT"]
[null,null,701.48599999999999,"REMOVE TIME CLOCK","EA"]
[null,"S",701.31600000000003,"REMOVE TRAFFIC SIGNAL CABLE","LS"]
[null,"S",701.71199999999999,"REMOVE TRAFFIC SIGNAL SYSTEM","LS"]
[null,null,701.77200000000005,"REMOVE TUNNEL LIGHTING SYSTEM","LS"]
[null,null,701.66600000000005,"REMOVE TUNNEL LUMINAIRE","EA"]
[null,null,701.65599999999995,"REMOVE UNDERPASS LUMINAIRE","EA"]
[null,"S",599.00073999999995,"REPAIR - ABUTMENT","LS"]
[null,"S",599.00066000000004,"REPAIR - BENT CAP","LS"]
[null,"S",599.00052000000005,"REPAIR - BOX CULVERT","SF"]
[null,"S",599.00054,"REPAIR - BOX CULVERT","LS"]
[null,"S",599.00049999999999,"REPAIR - BRIDGE","LS"]
[null,"S",599.00055999999995,"REPAIR - BRIDGE RAILING","LS"]
[null,"S",599.00058109999998,"REPAIR - BRIDGE RAILING","FT"]
[null,"S",599.00059999999996,"REPAIR - BRIDGE WINGWALL","LS"]
[null,"S",599.00062000000003,"REPAIR - GIRDERS","LS"]
[null,"S",599.00063999999998,"REPAIR - GIRDERS","EA"]
[null,"S",599.00070000000005,"REPAIR - PIER CAP","LS"]
[null,"S",599.00072,"REPAIR - PIER CAP END","CF"]
[null,"S",599.00058999999999,"REPAIR-BRIDGE COLUMNS","LS"]
[null,null,615.06136000000004,"REPLACE CATTLE GUARD GRILL (HEAVY DUTY) 36 ft ","EA"]
[null,null,615.08005000000003,"REPLACE CATTLE GUARD GRILL UNIT (MEDIUM DUTY) 24 ft ","EA"]
[null,null,606.06714999999997,"RESET BOX BEAM END TERM (WYBET)","EA"]
[null,null,606.05600000000004,"RESET BOX BEAM GUARDRAIL","FT"]
[null,null,606.06500000000005,"RESET BOX BEAM MED BARRIER","FT"]
[null,null,503.01299999999998,"RESET BRIDGE RAILING","LS"]
[null,null,503.01310000000001,"RESET BRIDGE RAILING","FT"]
[null,"S",606.06735000000003,"RESET CABLE MEDIAN BARRIER","FT"]
[null,null,615.07050000000004,"RESET CATTLE GUARD","EA"]
[null,null,615.06011999999998,"RESET CATTLE GUARD (HEAVY DUTY) 12 ft ","EA"]
[null,null,615.06017999999995,"RESET CATTLE GUARD (HEAVY DUTY) 18 ft ","EA"]
[null,null,615.06024000000002,"RESET CATTLE GUARD (HEAVY DUTY) 24 ft ","EA"]
[null,null,615.06029999999998,"RESET CATTLE GUARD (HEAVY DUTY) 30 ft ","EA"]
[null,null,615.06035999999995,"RESET CATTLE GUARD (HEAVY DUTY) 36 ft ","EA"]
[null,null,615.06042000000002,"RESET CATTLE GUARD (HEAVY DUTY) 42 ft ","EA"]
[null,null,615.07011999999997,"RESET CATTLE GUARD (MEDIUM DUTY) 12 ft ","EA"]
[null,null,615.07018000000005,"RESET CATTLE GUARD (MEDIUM DUTY) 18 ft ","EA"]
[null,null,615.07024000000001,"RESET CATTLE GUARD (MEDIUM DUTY) 24 ft ","EA"]
[null,null,615.07029999999997,"RESET CATTLE GUARD (MEDIUM DUTY) 30 ft ","EA"]
[null,null,615.07036000000005,"RESET CATTLE GUARD (MEDIUM DUTY) 36 ft ","EA"]
[null,null,615.07042000000001,"RESET CATTLE GUARD (MEDIUM DUTY) 42 ft ","EA"]
[null,null,606.04300000000001,"RESET CORR BEAM GUARDRAIL","FT"]
[null,null,606.04314999999997,"RESET CORR BEAM MED BARRIER","FT"]
[null,"S",702.50699999999995,"RESET DELINEATORS","EA"]
[null,null,607.51199999999994,"RESET FENCE","FT"]
[null,null,701.53700000000003,"RESET FRAMEWORK","EA"]
[null,null,607.70000000000005,"RESET GATES","EA"]
[null,null,701.24699999999996,"RESET LIGHTING POLE","EA"]
[null,null,202.03530000000001,"RESET MAILBOX (CANTILEVER)","EA"]
[null,null,202.0351,"RESET MAILBOX (DOUBLE)","EA"]
[null,null,202.0352,"RESET MAILBOX (MULTIPLE)","EA"]
[null,null,202.035,"RESET MAILBOX (SINGLE)","EA"]
[null,null,606.0104,"RESET MGS GUARDRAIL","FT"]
[null,null,606.02070000000003,"RESET MGS GUARDRAIL TERMINAL","EA"]
[null,"S",702.08,"RESET OVERHEAD SIGN","LS"]
[null,null,701.64700000000005,"RESET OVERHEAD SIGN LUMINAIRE","EA"]
[null,"S",702.09130000000005,"RESET OVERHEAD SIGN STRUCTURE","LS"]
[null,null,701.51700000000005,"RESET PED SIGNAL INDICATION","EA"]
[null,null,701.20699999999999,"RESET PULL BOX","EA"]
[null,null,701.63699999999994,"RESET REST AREA LUMINAIRE","EA"]
[null,null,701.62699999999995,"RESET ROADWAY LUMINAIRE","EA"]
[null,null,701.45699999999999,"RESET SIGNAL CONTROLLER","EA"]
[null,null,701.47699999999998,"RESET SIGNAL CONTROLLER AUX EQP","LS"]
[null,null,701.46699999999998,"RESET SIGNAL CONTROLLER CABINET","EA"]
[null,null,701.50699999999995,"RESET SIGNAL INDICATION","EA"]
[null,null,702.30600000000004,"RESET SIGNS","LS"]
[null,null,616.09,"RESET SNOW FENCE","EA"]
[null,null,701.48699999999997,"RESET TIME CLOCK","EA"]
[null,null,701.66700000000003,"RESET TUNNEL LUMINAIRE","EA"]
[null,null,701.65700000000004,"RESET UNDERPASS LUMINAIRE","EA"]
[null,null,701.74,"REST AREA LIGHTING SYSTEM","LS"]
[null,null,701.63099999999997,"REST AREA LUMINAIRE","EA"]
[null,"S",301.01094000000001,"REUSED BASE","CY"]
[null,"S",301.01096000000001,"REUSED BASE","TON"]
[null,"S",499.03035,"REUSED SURFACING","TON"]
[null,"S",499.03039999999999,"REUSED SURFACING","CY"]
[null,"S",499.03044999999997,"REUSED SURFACING","SY"]
[null,null,701.8,"ROAD CLOSURE SYSTEM","LS"]
[null,"S",701.81700000000001,"ROAD WEATHER INFORMATION SYSTEM","LS"]
[null,null,701.73,"ROADWAY LIGHTING SYSTEM","LS"]
[null,null,701.62099999999998,"ROADWAY LUMINAIRE","EA"]
[null,"S",219.04,"ROCK BOLTS","EA"]
[null,"S",219.05,"ROCK BOLTS (ENCAPSULATED)","EA"]
[null,"S",219.05009999999999,"ROCK BOLTS (ENCAPSULATED)","FT"]
[null,"S",219.05500000000001,"ROCK BOLTS (POINT ANCHORED)","EA"]
[null,null,215.03404,"ROCK CHECK DIKES","FT"]
[null,null,203.02199999999999,"ROCK EXCAVATION","CY"]
[null,"S",219.06,"ROCK RETENTION SYSTEM","LS"]
[null,null,219.01,"ROCKFALL MESH","SY"]
[null,null,210.0341,"ROLLER, TYPE I","HR"]
[null,null,210.0342,"ROLLER, TYPE II","HR"]
[null,null,210.0343,"ROLLER, TYPE III","HR"]
[null,null,210.03440000000001,"ROLLER, TYPE IV","HR"]
[null,null,210.03450000000001,"ROLLER, TYPE V","HR"]
[null,null,210.03460000000001,"ROLLER, TYPE VI","HR"]
[null,null,210.03469999999999,"ROLLER, TYPE VII","HR"]
[null,"S",399,"RUBBLIZING PAVEMENT","SY"]
[null,null,418.0102,"RUMBLE STRIP SECTION","EA"]
[null,null,418.01015999999998,"RUMBLE STRIPS (ASPHALT)","MI"]
[null,null,418.01017000000002,"RUMBLE STRIPS (CONCRETE)","MI"]
[null,null,418.01015000000001,"RUMBLE STRIPS (MILLED)","MI"]
[null,null,701.26,"SAFETY COVER ","EA"]
[null,"S",701.11,"SALVAGING","LS"]
[null,"S",699.07010000000002,"SANITARY SEWER LINE 10 in ","FT"]
[null,"S",699.07011999999997,"SANITARY SEWER LINE 12 in ","FT"]
[null,"S",699.07015000000001,"SANITARY SEWER LINE 15 in ","FT"]
[null,"S",699.07003999999995,"SANITARY SEWER LINE 4 in ","FT"]
[null,"S",699.07006000000001,"SANITARY SEWER LINE 6 in ","FT"]
[null,"S",699.07007999999996,"SANITARY SEWER LINE 8 in ","FT"]
[null,"S",699.07045000000005,"SANITARY SEWER LINE REPLACEMENT","LS"]
[null,"S",699.07050000000004,"SANITARY SEWER SYSTEM","LS"]
[null,null,701.55,"SAW CUT LOOP DETECTOR","EA"]
[null,"S",699.0104,"SCALE HOUSE","EA"]
[null,null,220.01,"SCALING (MACHINE)","HR"]
[null,null,220.01009999999999,"SCALING (MANUAL)","CRWH"]
[null,null,210.035,"SCRAPER","CYHR"]
[null,null,404.01004999999998,"SEAL COAT","TON"]
[null,"S",699.01070000000004,"SEALING AND BACKFILLING UNDERGROUND VAULTS","LS"]
[null,null,417.05,"SEALING CRACKS (CONC PVMT)","FT"]
[null,"S",417.05011000000002,"SEALING JOINTS","FT"]
[null,null,417.05009999999999,"SEALING JOINTS (CONC PVMT)","FT"]
[null,null,216.03104999999999,"SEEDING ","SY"]
[null,null,216.03107,"SEEDING ","LS"]
[null,null,216.03100000000001,"SEEDING (PLS)","LB"]
[null,null,216.03110000000001,"SEEDING SPECIAL (PLS)","LB"]
[null,"S",411.0102,"SELF-ADHERING WATERPROOFING MEMBRANE","FT"]
[null,null,703.03200000000004,"SEQUENTIAL CHEVRON","LS"]
[null,null,703.03201999999999,"SEQUENTIAL CHEVRON","EA"]
[null,null,701.21100000000001,"SERVICE POINT LIGHTING","EA"]
[null,null,701.21299999999997,"SERVICE POINT SIGNAL","EA"]
[null,"S",699.07039999999995,"SEWER LINE REPLACEMENT","LS"]
[null,"S",499.03356000000002,"SHOTBLAST/TEXTURE CONC PVMT","SY"]
[null,"S",513.02,"SHOTCRETE","SY"]
[null,"S",513.02009999999996,"SHOTCRETE","CY"]
[null,null,505.06099999999998,"SHOULDER BARRIER","FT"]
[null,null,701.53300000000002,"SIDE BRACKET FRAMEWORK","EA"]
[null,null,608.10199999999998,"SIDEWALK (CONC)","SY"]
[null,null,608.10203000000001,"SIDEWALK (CONC)","SF"]
[null,null,412.01060000000001,"SIDEWALK (PLANT MIX)","SY"]
[null,"S",608.10209999999995,"SIDEWALK DETECTABLE WARNING DEVICE","SF"]
[null,"SD",608.10204999999996,"SIDEWALK SPECIAL (CONC)","SY"]
[null,"SD",608.10208,"SIDEWALK SPECIAL (CONC)","SF"]
[null,null,702.30499999999995,"SIGN PANELS, ALUMINUM ","SF"]
[null,null,702.30399999999997,"SIGN PANELS, PLYWOOD ","SF"]
[null,null,702.30205000000001,"SIGN POST, RND TUBULAR STL","EA"]
[null,null,702.303,"SIGN POST, SQ TUBULAR STL","EA"]
[null,null,702.30200000000002,"SIGN POSTS, STL PIPE (BREAK-AWAY)","LB"]
[null,null,702.30139999999994,"SIGN POSTS, WOOD 10 in RND","FT"]
[null,null,702.30124999999998,"SIGN POSTS, WOOD 10 X 10 in","FT"]
[null,null,702.30100000000004,"SIGN POSTS, WOOD 4 X 4 in","FT"]
[null,null,702.30105000000003,"SIGN POSTS, WOOD 4 X 6 in","FT"]
[null,null,702.30129999999997,"SIGN POSTS, WOOD 6 in RND","FT"]
[null,null,702.30110000000002,"SIGN POSTS, WOOD 6 X 6 in","FT"]
[null,null,702.30115000000001,"SIGN POSTS, WOOD 6 X 8 in","FT"]
[null,null,702.30134999999996,"SIGN POSTS, WOOD 8 in RND","FT"]
[null,null,702.30119999999999,"SIGN POSTS, WOOD 8 X 8 in","FT"]
[null,"S",702.09119999999996,"SIGN STRUCTURE REPAIR","LS"]
[null,null,701.31039999999996,"SIGNAL CABLE 12 CONDUCTOR #14 AWG","FT"]
[null,null,701.31050000000005,"SIGNAL CABLE 15 CONDUCTOR #14 AWG","FT"]
[null,null,701.31055000000003,"SIGNAL CABLE 16 CONDUCTOR #12 AWG","FT"]
[null,null,701.31060000000002,"SIGNAL CABLE 19 CONDUCTOR #14 AWG","FT"]
[null,null,701.3107,"SIGNAL CABLE 21 CONDUCTOR #14 AWG","FT"]
[null,null,701.31010000000003,"SIGNAL CABLE 3 CONDUCTOR #14 AWG","FT"]
[null,null,701.31020000000001,"SIGNAL CABLE 5 CONDUCTOR #14 AWG","FT"]
[null,null,701.31029999999998,"SIGNAL CABLE 7 CONDUCTOR #14 AWG","FT"]
[null,null,701.45100000000002,"SIGNAL CONTROLLER","EA"]
[null,null,701.471,"SIGNAL CONTROLLER AUX EQP","LS"]
[null,null,701.46100000000001,"SIGNAL CONTROLLER CABINET","EA"]
[null,null,701.50009999999997,"SIGNAL INDICATION 12 ","EA"]
[null,null,701.50049999999999,"SIGNAL INDICATION 12-12-12 ","EA"]
[null,null,701.50059999999996,"SIGNAL INDICATION 12-12-12-12-12","EA"]
[null,null,701.50040000000001,"SIGNAL INDICATION 12-8-8","EA"]
[null,null,701.50014999999996,"SIGNAL INDICATION 12-SOLAR","EA"]
[null,null,701.50030000000004,"SIGNAL INDICATION 8-8-8 ","EA"]
[null,null,515.02800000000002,"SILICA FUME MODIFIED CONCRETE","CY"]
[null,null,515.02805000000001,"SILICA FUME MODIFIED CONCRETE","LS"]
[null,null,215.03299999999999,"SILT FENCE","FT"]
[null,null,701.2903,"SINGLE CONDUCTOR WIRE  #1 AWG","FT"]
[null,null,701.29020000000003,"SINGLE CONDUCTOR WIRE  #1/0 AWG","FT"]
[null,null,701.29079999999999,"SINGLE CONDUCTOR WIRE  #10 AWG","FT"]
[null,null,701.29089999999997,"SINGLE CONDUCTOR WIRE  #12 AWG","FT"]
[null,null,701.29100000000005,"SINGLE CONDUCTOR WIRE  #14 AWG","FT"]
[null,null,701.29039999999998,"SINGLE CONDUCTOR WIRE  #2 AWG","FT"]
[null,null,701.29010000000005,"SINGLE CONDUCTOR WIRE  #2/0 AWG","FT"]
[null,null,701.29,"SINGLE CONDUCTOR WIRE  #3/0 AWG","FT"]
[null,null,701.29049999999995,"SINGLE CONDUCTOR WIRE  #4 AWG","FT"]
[null,null,701.29004999999995,"SINGLE CONDUCTOR WIRE  #4/0 AWG","FT"]
[null,null,701.29060000000004,"SINGLE CONDUCTOR WIRE  #6 AWG","FT"]
[null,null,701.29070000000002,"SINGLE CONDUCTOR WIRE  #8 AWG","FT"]
[null,"S",415.02021999999999,"SLAB LIFTING AND UNDERSEALING","LB"]
[null,"S",415.02023000000003,"SLAB LIFTING AND UNDERSEALING","CF"]
[null,"D",625.5,"SLIDE GATE A","EA"]
[null,"D",625.50009999999997,"SLIDE GATE B","EA"]
[null,"D",625.50014999999996,"SLIDE GATE C","EA"]
[null,"D",625.50019999999995,"SLIDE GATE D","EA"]
[null,"D",625.50099999999998,"SLIDE GATE W","EA"]
[null,"D",625.50199999999995,"SLIDE GATE X","EA"]
[null,"D",625.50300000000004,"SLIDE GATE Y","EA"]
[null,"D",625.50400000000002,"SLIDE GATE Z","EA"]
[null,"S",511.06020000000001,"SLIDE STABILIZATION ROCK (SSR)","CY"]
[null,null,508.01101,"SLOPE PAVING REPAIR/MODIFICATION","SY"]
[null,null,631.01012000000003,"SLOTTED DRAIN 12 in ","FT"]
[null,null,631.01014999999995,"SLOTTED DRAIN 15 in ","FT"]
[null,null,631.01017999999999,"SLOTTED DRAIN 18 in ","FT"]
[null,null,631.01023999999995,"SLOTTED DRAIN 24 in ","FT"]
[null,null,631.01030000000003,"SLOTTED DRAIN 30 in ","FT"]
[null,null,631.01035999999999,"SLOTTED DRAIN 36 in ","FT"]
[null,null,603.64121,"SME ARCH SECT 21 X 15 in ","EA"]
[null,null,603.64220999999998,"SME ARCH SECT 21 X 15 in W/ GRATE ","EA"]
[null,null,603.64124000000004,"SME ARCH SECT 24 X 18 in ","EA"]
[null,null,603.64224000000002,"SME ARCH SECT 24 X 18 in W/ GRATE ","EA"]
[null,null,603.64128000000005,"SME ARCH SECT 28 X 20 in ","EA"]
[null,null,603.64228000000003,"SME ARCH SECT 28 X 20 in W/ GRATE ","EA"]
[null,null,603.64134999999999,"SME ARCH SECT 35 X 24 in ","EA"]
[null,null,603.64234999999996,"SME ARCH SECT 35 X 24 in W/ GRATE ","EA"]
[null,null,603.64142000000004,"SME ARCH SECT 42 X 29 in ","EA"]
[null,null,603.64242000000002,"SME ARCH SECT 42 X 29 in W/ GRATE ","EA"]
[null,null,603.64148999999998,"SME ARCH SECT 49 X 33 in ","EA"]
[null,null,603.64248999999995,"SME ARCH SECT 49 X 33 in W/ GRATE ","EA"]
[null,null,603.64157,"SME ARCH SECT 57 X 38 in ","EA"]
[null,null,603.64256999999998,"SME ARCH SECT 57 X 38 in W/ GRATE ","EA"]
[null,null,603.64164000000005,"SME ARCH SECT 64 X 43 in ","EA"]
[null,null,603.64264000000003,"SME ARCH SECT 64 X 43 in W/ GRATE ","EA"]
[null,null,603.64170999999999,"SME ARCH SECT 71 X 47 in ","EA"]
[null,null,603.64270999999997,"SME ARCH SECT 71 X 47 in W/ GRATE ","EA"]
[null,null,603.64183000000003,"SME ARCH SECT 83 X 57 in ","EA"]
[null,null,603.64283,"SME ARCH SECT 83 X 57 in W/ GRATE ","EA"]
[null,null,603.53012000000001,"SME SECT 12 in  ","EA"]
[null,null,603.53015000000005,"SME SECT 15 in  ","EA"]
[null,null,603.55015000000003,"SME SECT 15 in W/ GRATE ","EA"]
[null,null,603.53017999999997,"SME SECT 18 in  ","EA"]
[null,null,603.55017999999995,"SME SECT 18 in W/ GRATE ","EA"]
[null,null,603.53021000000001,"SME SECT 21 in  ","EA"]
[null,null,603.55020999999999,"SME SECT 21 in W/ GRATE ","EA"]
[null,null,603.53024000000005,"SME SECT 24 in  ","EA"]
[null,null,603.55024000000003,"SME SECT 24 in W/ GRATE ","EA"]
[null,null,603.53030000000001,"SME SECT 30 in  ","EA"]
[null,null,603.55029999999999,"SME SECT 30 in W/ GRATE ","EA"]
[null,null,603.53035999999997,"SME SECT 36 in  ","EA"]
[null,null,603.55035999999996,"SME SECT 36 in W/ GRATE ","EA"]
[null,null,603.53042000000005,"SME SECT 42 in  ","EA"]
[null,null,603.55042000000003,"SME SECT 42 in W/ GRATE ","EA"]
[null,null,603.53048000000001,"SME SECT 48 in  ","EA"]
[null,null,603.55047999999999,"SME SECT 48 in W/ GRATE ","EA"]
[null,null,603.53053999999997,"SME SECT 54 in  ","EA"]
[null,null,603.55053999999996,"SME SECT 54 in W/ GRATE ","EA"]
[null,null,603.53060000000005,"SME SECT 60 in  ","EA"]
[null,null,603.55060000000003,"SME SECT 60 in W/ GRATE ","EA"]
[null,"SD",616.09109999999998,"SNOW FENCE (EMBEDDED POSTS) 10 ft","FT"]
[null,"SD",616.09112000000005,"SNOW FENCE (EMBEDDED POSTS) 12 ft","FT"]
[null,"SD",616.09105999999997,"SNOW FENCE (EMBEDDED POSTS) 6 ft","FT"]
[null,"SD",616.09108000000003,"SNOW FENCE (EMBEDDED POSTS) 8 ft","FT"]
[null,null,616.09010000000001,"SNOW FENCE (WOOD) 10 ft ","EA"]
[null,null,616.09011999999996,"SNOW FENCE (WOOD) 12 ft ","EA"]
[null,"D",616.09005999999999,"SNOW FENCE (WOOD) 6 ft ","EA"]
[null,"D",616.09007999999994,"SNOW FENCE (WOOD) 8 ft ","EA"]
[null,null,616.09019999999998,"SNOW FENCE REPAIR","$$"]
[null,"SD",616.09029999999996,"SNOW FENCE WOOD LATH 4 ft","FT"]
[null,null,216.03700000000001,"SODDING","SY"]
[null,null,310.03800000000001,"SODIUM CHLORIDE ","TON"]
[null,"S",219.035,"SOIL ANCHORS","EA"]
[null,"S",217.01085,"SOIL REINFORCING MATTING","SY"]
[null,"S",799.71900000000005,"SOLID LINE STRIPING","MI"]
[null,"D",609.10109999999997,"SPECIAL CURB TYPE D","FT"]
[null,"D",609.10119999999995,"SPECIAL CURB TYPE X","FT"]
[null,"S",640.00016000000005,"SPECIAL ITEM CF-A","CF"]
[null,"S",640.00017000000003,"SPECIAL ITEM CF-B","CF"]
[null,"S",640.00018,"SPECIAL ITEM CF-C","CF"]
[null,"S",640.00009999999997,"SPECIAL ITEM CY-A","CY"]
[null,"S",640.00010999999995,"SPECIAL ITEM CY-B","CY"]
[null,"S",640.00012000000004,"SPECIAL ITEM CY-C","CY"]
[null,"S",640.00031999999999,"SPECIAL ITEM CY-D","CY"]
[null,"S",640.00032999999996,"SPECIAL ITEM CY-E","CY"]
[null,"S",640.00004000000001,"SPECIAL ITEM EA-A","EA"]
[null,"S",640.00004999999999,"SPECIAL ITEM EA-B","EA"]
[null,"S",640.00005999999996,"SPECIAL ITEM EA-C","EA"]
[null,"S",640.00025000000005,"SPECIAL ITEM EA-D","EA"]
[null,"S",640.00027,"SPECIAL ITEM EA-E","EA"]
[null,"S",640.00007000000005,"SPECIAL ITEM FT-A","FT"]
[null,"S",640.00008000000003,"SPECIAL ITEM FT-B","FT"]
[null,"S",640.00009,"SPECIAL ITEM FT-C","FT"]
[null,"S",640.00022999999999,"SPECIAL ITEM FT-D","FT"]
[null,"S",640.00023999999996,"SPECIAL ITEM FT-E ","FT"]
[null,"S",640.00022000000001,"SPECIAL ITEM HR-A","HR"]
[null,"S",640.00000999999997,"SPECIAL ITEM LS-A","LS"]
[null,"S",640.00001999999995,"SPECIAL ITEM LS-B","LS"]
[null,"S",640.00003000000004,"SPECIAL ITEM LS-C","LS"]
[null,"S",640.00026000000003,"SPECIAL ITEM LS-D","LS"]
[null,"S",640.00027999999998,"SPECIAL ITEM LS-E","LS"]
[null,"S",640.00028999999995,"SPECIAL ITEM LS-F","LS"]
[null,"S",640.00018999999998,"SPECIAL ITEM SF-A","SF"]
[null,"S",640.00019999999995,"SPECIAL ITEM SF-B","SF"]
[null,"S",640.00021000000004,"SPECIAL ITEM SF-C","SF"]
[null,"S",640.00013000000001,"SPECIAL ITEM SY-A","SY"]
[null,"S",640.00013999999999,"SPECIAL ITEM SY-B","SY"]
[null,"S",640.00014999999996,"SPECIAL ITEM SY-C","SY"]
[null,"S",640.00030000000004,"SPECIAL ITEM SY-D","SY"]
[null,"S",640.00031000000001,"SPECIAL ITEM SY-E","SY"]
[null,"S",640.00034000000005,"SPECIAL ITEM TON-A","TON"]
[null,"S",640.00035000000003,"SPECIAL ITEM TON-B","TON"]
[null,null,412.01029999999997,"SPILLWAY (PLANT MIX)","FT"]
[null,"S",702.30501000000004,"SPLASH BOARDS","FT"]
[null,null,701.39,"SPLICING KIT","EA"]
[null,"S",699.06055000000003,"SPRINKLER SYSTEM","LS"]
[null,"S",699.06060000000002,"SPRINKLER SYSTEM","SF"]
[null,"S",699.06050000000005,"SPRINKLER SYSTEM DISCONNECT","LS"]
[null,"S",399.00022000000001,"STABILIZED FULL DEPTH RECLAMATION","SY"]
[null,"S",599.00004000000001,"STEEL BIN - TYPE RETAINING WALL","SF"]
[null,"S",599.00103999999999,"STEEL CRIBBING","SF"]
[null,null,504.11041999999998,"STEEL PILING HP 10 X 42 ","FT"]
[null,null,504.11252999999999,"STEEL PILING HP 12 X 53 ","FT"]
[null,null,504.11273999999997,"STEEL PILING HP 12 X 74","FT"]
[null,null,504.11284000000001,"STEEL PILING HP 12 X 84","FT"]
[null,null,504.11401999999998,"STEEL PILING HP 14 X 102","FT"]
[null,null,504.11417,"STEEL PILING HP 14 X 117","FT"]
[null,null,504.11473000000001,"STEEL PILING HP 14 X 73","FT"]
[null,null,504.11489,"STEEL PILING HP 14 X 89","FT"]
[null,"S",504.11599999999999,"STEEL SHEET PILING","LS"]
[null,null,504.11615999999998,"STEEL SHEET PILING (SM 16.0)","SF"]
[null,null,504.11630000000002,"STEEL SHEET PILING (SM 30.0)","SF"]
[null,null,702.096,"STL BREAK-AWAY SIGN SUPPORT W10 X 26","FT"]
[null,null,702.09604999999999,"STL BREAK-AWAY SIGN SUPPORT W10 X 26","LS"]
[null,null,702.09699999999998,"STL BREAK-AWAY SIGN SUPPORT W14 X 30","FT"]
[null,null,702.09704999999997,"STL BREAK-AWAY SIGN SUPPORT W14 X 30","LS"]
[null,null,702.09709999999995,"STL BREAK-AWAY SIGN SUPPORT W18 X 35","FT"]
[null,null,702.09712999999999,"STL BREAK-AWAY SIGN SUPPORT W18 X 40","FT"]
[null,null,702.09715000000006,"STL BREAK-AWAY SIGN SUPPORT W21 X 44","FT"]
[null,null,702.09299999999996,"STL BREAK-AWAY SIGN SUPPORT W6 X 12","FT"]
[null,null,702.09304999999995,"STL BREAK-AWAY SIGN SUPPORT W6 X 12","LS"]
[null,null,702.09400000000005,"STL BREAK-AWAY SIGN SUPPORT W6 X 15","FT"]
[null,null,702.09405000000004,"STL BREAK-AWAY SIGN SUPPORT W6 X 15","LS"]
[null,null,702.09500000000003,"STL BREAK-AWAY SIGN SUPPORT W8 X 21","FT"]
[null,null,702.09505000000001,"STL BREAK-AWAY SIGN SUPPORT W8 X 21","LS"]
[null,null,702.09100000000001,"STL OVERHEAD SIGN SUPPORT","LS"]
[null,null,701.24009999999998,"STL POLE TYPE I","EA"]
[null,null,701.24019999999996,"STL POLE TYPE II","EA"]
[null,null,701.24030000000005,"STL POLE TYPE III","EA"]
[null,null,701.24040000000002,"STL POLE TYPE IV","EA"]
[null,null,701.2405,"STL POLE TYPE V","EA"]
[null,null,701.24059999999997,"STL POLE TYPE VI","EA"]
[null,null,701.24069999999995,"STL POLE TYPE VII","EA"]
[null,null,310.0102,"STOCKPILED AGGREGATE","TON"]
[null,null,310.01020999999997,"STOCKPILED AGGREGATE","CY"]
[null,null,310.01035000000002,"STOCKPILED CHIP SEAL AGGREGATE","TON"]
[null,null,310.0104,"STOCKPILED CHIP SEAL AGGREGATE","CY"]
[null,null,310.01029999999997,"STOCKPILED CRUSHED BASE","TON"]
[null,null,310.01031999999998,"STOCKPILED CRUSHED BASE","CY"]
[null,null,310.01,"STOCKPILED CRUSHER RUN SUBBASE","TON"]
[null,null,310.01002,"STOCKPILED CRUSHER RUN SUBBASE","CY"]
[null,null,310.01004999999998,"STOCKPILED PIT RUN AGGREGATE","TON"]
[null,null,310.01006999999998,"STOCKPILED PIT RUN AGGREGATE","CY"]
[null,null,310.01015000000001,"STOCKPILED PIT RUN FILLER MATERIAL","TON"]
[null,null,310.01017000000002,"STOCKPILED PIT RUN FILLER MATERIAL","CY"]
[null,"S",399.00031999999999,"STOCKPILED RECLAIMED ASPHALT PAVEMENT","CY"]
[null,null,310.01010000000002,"STOCKPILED SCREENED AGGREGATE","TON"]
[null,null,310.01011999999997,"STOCKPILED SCREENED AGGREGATE","CY"]
[null,null,310.01011,"STOCKPILED SCREENED AGGREGATE (SALT MIXED)","TON"]
[null,null,310.01013,"STOCKPILED SCREENED AGGREGATE (SALT MIXED)","CY"]
[null,"S",699.07055000000003,"STORM SEWER SYSTEM","LS"]
[null,"SD",625.12045000000001,"STORM WATER TREATMENT SYSTEM","EA"]
[null,"S",399.00027,"STREAM BED MATERIAL","CY"]
[null,"S",212.03915000000001,"STRUCTURAL BACKFILL MATERIAL","CY"]
[null,null,622.10059999999999,"STRUCTURAL PLATE PIPE  60 in ","FT"]
[null,null,622.10065999999995,"STRUCTURAL PLATE PIPE  66 in ","FT"]
[null,null,622.10072000000002,"STRUCTURAL PLATE PIPE  72 in ","FT"]
[null,null,622.10077999999999,"STRUCTURAL PLATE PIPE  78 in ","FT"]
[null,null,622.10083999999995,"STRUCTURAL PLATE PIPE  84 in ","FT"]
[null,null,622.10090000000002,"STRUCTURAL PLATE PIPE  90 in ","FT"]
[null,null,622.10095999999999,"STRUCTURAL PLATE PIPE  96 in","FT"]
[null,null,622.10101999999995,"STRUCTURAL PLATE PIPE 102 in ","FT"]
[null,null,622.10108000000002,"STRUCTURAL PLATE PIPE 108 in ","FT"]
[null,null,622.10113999999999,"STRUCTURAL PLATE PIPE 114 in ","FT"]
[null,null,622.10119999999995,"STRUCTURAL PLATE PIPE 120 in ","FT"]
[null,null,622.10126000000002,"STRUCTURAL PLATE PIPE 126 in ","FT"]
[null,null,622.10131999999999,"STRUCTURAL PLATE PIPE 132 in ","FT"]
[null,null,622.10137999999995,"STRUCTURAL PLATE PIPE 138 in ","FT"]
[null,null,622.10144000000003,"STRUCTURAL PLATE PIPE 144 in ","FT"]
[null,null,622.10149999999999,"STRUCTURAL PLATE PIPE 150 in ","FT"]
[null,null,622.10155999999995,"STRUCTURAL PLATE PIPE 156 in ","FT"]
[null,null,622.10162000000003,"STRUCTURAL PLATE PIPE 162 in ","FT"]
[null,null,622.10167999999999,"STRUCTURAL PLATE PIPE 168 in ","FT"]
[null,null,622.10173999999995,"STRUCTURAL PLATE PIPE 174 in ","FT"]
[null,null,622.10180000000003,"STRUCTURAL PLATE PIPE 180 in ","FT"]
[null,null,622.20102999999995,"STRUCTURAL PLATE PIPE-ARCH 103 X 71 in ","FT"]
[null,null,622.20105999999998,"STRUCTURAL PLATE PIPE-ARCH 106 X 73 in ","FT"]
[null,null,622.20111999999995,"STRUCTURAL PLATE PIPE-ARCH 112 X 75 in ","FT"]
[null,null,622.20114000000001,"STRUCTURAL PLATE PIPE-ARCH 114 X 77 in ","FT"]
[null,null,622.20117000000005,"STRUCTURAL PLATE PIPE-ARCH 117 X 79 in ","FT"]
[null,null,622.20123000000001,"STRUCTURAL PLATE PIPE-ARCH 123 X 81 in ","FT"]
[null,null,622.20128,"STRUCTURAL PLATE PIPE-ARCH 128 X 83 in ","FT"]
[null,null,622.20131000000003,"STRUCTURAL PLATE PIPE-ARCH 131 X 85 in ","FT"]
[null,null,622.20137,"STRUCTURAL PLATE PIPE-ARCH 137 X 87 in ","FT"]
[null,null,622.20138999999995,"STRUCTURAL PLATE PIPE-ARCH 139 X 89 in ","FT"]
[null,null,622.20141999999998,"STRUCTURAL PLATE PIPE-ARCH 142 X 91 in ","FT"]
[null,null,622.20147999999995,"STRUCTURAL PLATE PIPE-ARCH 148 X 93 in ","FT"]
[null,null,622.20150000000001,"STRUCTURAL PLATE PIPE-ARCH 150 X 95 in ","FT"]
[null,null,622.20151999999996,"STRUCTURAL PLATE PIPE-ARCH 152 X 97 in ","FT"]
[null,null,622.20154000000002,"STRUCTURAL PLATE PIPE-ARCH 154 X 100 in ","FT"]
[null,null,622.20159000000001,"STRUCTURAL PLATE PIPE-ARCH 159 X 112 in ","FT"]
[null,null,622.20162000000005,"STRUCTURAL PLATE PIPE-ARCH 162 X 114 in ","FT"]
[null,null,622.20168000000001,"STRUCTURAL PLATE PIPE-ARCH 168 X 116 in ","FT"]
[null,null,622.20169999999996,"STRUCTURAL PLATE PIPE-ARCH 170 X 118 in","FT"]
[null,null,622.20173,"STRUCTURAL PLATE PIPE-ARCH 173 X 120 in ","FT"]
[null,null,622.20178999999996,"STRUCTURAL PLATE PIPE-ARCH 179 X 122 in ","FT"]
[null,null,622.20183999999995,"STRUCTURAL PLATE PIPE-ARCH 184 X 124 in ","FT"]
[null,null,622.20186999999999,"STRUCTURAL PLATE PIPE-ARCH 187 X 126 in ","FT"]
[null,null,622.20190000000002,"STRUCTURAL PLATE PIPE-ARCH 190 X 128 in ","FT"]
[null,null,622.20195000000001,"STRUCTURAL PLATE PIPE-ARCH 195 X 130 in ","FT"]
[null,null,622.20198000000005,"STRUCTURAL PLATE PIPE-ARCH 198 X 132 in ","FT"]
[null,null,622.20199000000002,"STRUCTURAL PLATE PIPE-ARCH 199 X 121 in ","FT"]
[null,null,622.20204000000001,"STRUCTURAL PLATE PIPE-ARCH 204 X 134 in ","FT"]
[null,null,622.20205999999996,"STRUCTURAL PLATE PIPE-ARCH 206 X 136 in ","FT"]
[null,null,622.20209,"STRUCTURAL PLATE PIPE-ARCH 209 X 138 in","FT"]
[null,null,622.20214999999996,"STRUCTURAL PLATE PIPE-ARCH 215 X 140 in ","FT"]
[null,null,622.20217000000002,"STRUCTURAL PLATE PIPE-ARCH 217 X 142 in","FT"]
[null,null,622.20222999999999,"STRUCTURAL PLATE PIPE-ARCH 223 X 144 in ","FT"]
[null,null,622.20225000000005,"STRUCTURAL PLATE PIPE-ARCH 225 X 146 in ","FT"]
[null,null,622.20231000000001,"STRUCTURAL PLATE PIPE-ARCH 231 X 148 in ","FT"]
[null,null,622.20234000000005,"STRUCTURAL PLATE PIPE-ARCH 234 X 150 in ","FT"]
[null,null,622.20236,"STRUCTURAL PLATE PIPE-ARCH 236 X 152 in ","FT"]
[null,null,622.20239000000004,"STRUCTURAL PLATE PIPE-ARCH 239 X 154 in ","FT"]
[null,null,622.20245,"STRUCTURAL PLATE PIPE-ARCH 245 X 156 in ","FT"]
[null,null,622.20246999999995,"STRUCTURAL PLATE PIPE-ARCH 247 X 158 in ","FT"]
[null,null,622.20069999999998,"STRUCTURAL PLATE PIPE-ARCH 70 X 78 in ","FT"]
[null,null,622.20075999999995,"STRUCTURAL PLATE PIPE-ARCH 76 X 57 in ","FT"]
[null,null,622.20081000000005,"STRUCTURAL PLATE PIPE-ARCH 81 X 59 in ","FT"]
[null,null,622.20083999999997,"STRUCTURAL PLATE PIPE-ARCH 84 X 61 in ","FT"]
[null,null,622.20087000000001,"STRUCTURAL PLATE PIPE-ARCH 87 X  63 in","FT"]
[null,null,622.20092,"STRUCTURAL PLATE PIPE-ARCH 92 X  65 in ","FT"]
[null,null,622.20095000000003,"STRUCTURAL PLATE PIPE-ARCH 95 X 67 in ","FT"]
[null,null,622.20097999999996,"STRUCTURAL PLATE PIPE-ARCH 98 X 69 in ","FT"]
[null,null,622.20073000000002,"STRUCTURAL PLATE PIPE-ARCH73 X 55 in ","FT"]
[null,null,622.30206999999996,"STRUCTURAL PLATE STOCK PASS 207 X 204 in ","FT"]
[null,null,622.30068000000006,"STRUCTURAL PLATE STOCK PASS 68 X 78 in ","FT"]
[null,null,622.30070000000001,"STRUCTURAL PLATE STOCK PASS 70 X 92 in ","FT"]
[null,null,501.01,"STRUCTURAL STEEL","LS"]
[null,null,501.01004999999998,"STRUCTURAL STEEL","LB"]
[null,"S",599.00102000000004,"STRUCTURAL TIMBER          [DO NOT USE]","MBM"]
[null,"S",212.03919999999999,"STRUCTURE EXCAVATION","CY"]
[null,null,999.25,"STRUCTURE ITEMS","LS"]
[null,null,301.01049999999998,"SUBBASE","TON"]
[null,null,301.01055000000002,"SUBBASE","CY"]
[null,null,301.01056999999997,"SUBBASE","SY"]
[null,"S",415.02019999999999,"SUBSEAL GROUTING","CF"]
[null,"S",599.0009,"SUPERSTRUCTURE RAISING","LS"]
[null,"S",216.03960000000001,"SYNTHETIC MATTING","SY"]
[null,null,407.01,"TACK COAT","TON"]
[null,"S",799.74300000000005,"TEMPORARY APRON MARKING","SF"]
[null,"S",599.00067999999999,"TEMPORARY BENTS","LS"]
[null,"S",799.74400000000003,"TEMPORARY BLASTPAD MARKING","SF"]
[null,null,703.03409999999997,"TEMPORARY CONCRETE BARRIER","FT"]
[null,null,703.03420000000006,"TEMPORARY CONCRETE TERMINAL","EA"]
[null,null,606.06719999999996,"TEMPORARY GUARDRAIL","EA"]
[null,"S",799.74099999999999,"TEMPORARY RUNWAY PAVEMENT MARKING","SF"]
[null,"S",799.74199999999996,"TEMPORARY TAXIWAY PAVEMENT MARKING","SF"]
[null,null,703.03110000000004,"TEMPORARY TRAFFIC CONTROL","LS"]
[null,"S",503.01209999999998,"TEMPORARY TRAFFIC RAILING MODIFICATION","LS"]
[null,"S",703.03520000000003,"TEMPORARY TRAFFIC SIGNAL SYSTEM","LS"]
[null,null,401.0204,"TEST STRIP","EA"]
[null,"S",799.70100000000002,"THERMOPLASTIC PAVEMENT MARKINGS","LS"]
[null,"S",799.70105000000001,"THERMOPLASTIC PAVEMENT MARKINGS","SF"]
[null,"S",799.70118000000002,"THERMOPLASTIC PAVEMENT MARKINGS 18 in","FT"]
[null,"S",799.70123999999998,"THERMOPLASTIC PAVEMENT MARKINGS 24 in","FT"]
[null,"S",799.70108000000005,"THERMOPLASTIC PAVEMENT MARKINGS 8 in","FT"]
[null,"S",606.01002000000005,"THRIE BEAM MED BARRIER","FT"]
[null,"S",606.01016000000004,"THRIE BEAM MED BARRIER TERM","EA"]
[null,null,620.08000000000004,"THRUST BLOCKS","EA"]
[null,"S",599.00106000000005,"TIMBER CRIBBING","SF"]
[null,"S",699.01065000000006,"TIMBER ROOF SYSTEM","LS"]
[null,null,701.48099999999999,"TIME CLOCK","EA"]
[null,null,207.03299999999999,"TOPSOIL BORROW","CY"]
[null,null,207.03200000000001,"TOPSOIL PLACING","CY"]
[null,null,207.03100000000001,"TOPSOIL STORING","CY"]
[null,null,704.01,"TRAFFIC CONTROL MAINTENANCE                       (DO NOT USE)","SHFT"]
[null,null,999.26,"TRAFFIC ITEMS","LS"]
[null,null,701.71,"TRAFFIC SIGNAL SYSTEM","LS"]
[null,null,619.01017999999999,"TRASH GUARD 18 in ","EA"]
[null,null,619.03017999999997,"TRASH GUARD 18 in EQUIV CMP ARCH ","EA"]
[null,null,619.01023999999995,"TRASH GUARD 24 in ","EA"]
[null,null,619.03024000000005,"TRASH GUARD 24 in EQUIV CMP ARCH ","EA"]
[null,null,619.05024000000003,"TRASH GUARD 24 in EQUIV RCP ARCH ","EA"]
[null,null,619.06024000000002,"TRASH GUARD 24 in EQUIV RCP ELLIPTICAL ","EA"]
[null,null,619.01030000000003,"TRASH GUARD 30 in ","EA"]
[null,null,619.03030000000001,"TRASH GUARD 30 in EQUIV CMP ARCH ","EA"]
[null,null,619.05029999999999,"TRASH GUARD 30 in EQUIV RCP ARCH ","EA"]
[null,null,619.06029999999998,"TRASH GUARD 30 in EQUIV RCP ELLIPTICAL ","EA"]
[null,null,619.01035999999999,"TRASH GUARD 36 in ","EA"]
[null,null,619.03035999999997,"TRASH GUARD 36 in EQUIV CMP ARCH ","EA"]
[null,null,619.05035999999996,"TRASH GUARD 36 in EQUIV RCP ARCH ","EA"]
[null,null,619.06035999999995,"TRASH GUARD 36 in EQUIV RCP ELLIPTICAL ","EA"]
[null,null,619.01041999999995,"TRASH GUARD 42 in ","EA"]
[null,null,619.03042000000005,"TRASH GUARD 42 in EQUIV CMP ARCH ","EA"]
[null,null,619.05042000000003,"TRASH GUARD 42 in EQUIV RCP ARCH ","EA"]
[null,null,619.06042000000002,"TRASH GUARD 42 in EQUIV RCP ELLIPTICAL ","EA"]
[null,null,619.01048000000003,"TRASH GUARD 48 in ","EA"]
[null,null,619.03048000000001,"TRASH GUARD 48 in EQUIV CMP ARCH ","EA"]
[null,null,619.05047999999999,"TRASH GUARD 48 in EQUIV RCP ARCH ","EA"]
[null,null,619.06047999999998,"TRASH GUARD 48 in EQUIV RCP ELLIPTICAL ","EA"]
[null,null,619.01053999999999,"TRASH GUARD 54 in ","EA"]
[null,null,619.06053999999995,"TRASH GUARD 54 in EQUIV RCP ELLIPTICAL ","EA"]
[null,null,619.01059999999995,"TRASH GUARD 60 in ","EA"]
[null,null,619.01066000000003,"TRASH GUARD 66 in ","EA"]
[null,null,619.02017999999998,"TRASH GUARD CMP 18 in ","EA"]
[null,null,619.02023999999994,"TRASH GUARD CMP 24 in ","EA"]
[null,null,619.02030000000002,"TRASH GUARD CMP 30 in ","EA"]
[null,null,619.02035999999998,"TRASH GUARD CMP 36 in ","EA"]
[null,null,619.02041999999994,"TRASH GUARD CMP 42 in ","EA"]
[null,null,619.02048000000002,"TRASH GUARD CMP 48 in ","EA"]
[null,null,619.02077999999995,"TRASH GUARD CMP 78 in ","EA"]
[null,null,619.04017999999996,"TRASH GUARD RCP 18 in ","EA"]
[null,null,619.04024000000004,"TRASH GUARD RCP 24 in ","EA"]
[null,null,619.0403,"TRASH GUARD RCP 30 in ","EA"]
[null,null,619.04035999999996,"TRASH GUARD RCP 36 in ","EA"]
[null,null,619.04042000000004,"TRASH GUARD RCP 42 in ","EA"]
[null,null,619.04048,"TRASH GUARD RCP 48 in ","EA"]
[null,null,619.04053999999996,"TRASH GUARD RCP 54 in ","EA"]
[null,null,619.04060000000004,"TRASH GUARD RCP 60 in ","EA"]
[null,null,619.04066,"TRASH GUARD RCP 66 in ","EA"]
[null,null,619.04078000000004,"TRASH GUARD RCP 78 in ","EA"]
[null,"S",216.07499999999999,"TREE GRATES","EA"]
[null,null,206.03200000000001,"TRENCH SUBEXCAVATION","CY"]
[null,null,701.12,"TRENCHING AND BACKFILLING","FT"]
[null,null,701.12009999999998,"TRENCHING AND BACKFILLING","LS"]
[null,null,215.03309999999999,"TRIANGULAR SILT DIKE","FT"]
[null,"S",199.0001,"TRIBAL EMPLOYMENT RIGHTS ORDINANCE","LS"]
[null,null,210.036,"TRUCK","CYHR"]
[null,"S",701.66200000000003,"TUNNEL LIGHTING FIXTURE MOUNTING HARDWARE","LS"]
[null,null,701.77,"TUNNEL LIGHTING SYSTEM","LS"]
[null,null,701.66099999999994,"TUNNEL LUMINAIRE","EA"]
[null,null,701.21315000000004,"TYPE I SOLAR SERVICE POINT","EA"]
[null,null,701.21325000000002,"TYPE II SOLAR SERVICE POINT","EA"]
[null,null,203.02500000000001,"UNCLASSIFIED EXCAVATION","CY"]
[null,null,605.20010000000002,"UNDERDRAIN PIPE (NON-PERF) 10 in  ","FT"]
[null,null,605.20011999999997,"UNDERDRAIN PIPE (NON-PERF) 12 in  ","FT"]
[null,null,605.20015000000001,"UNDERDRAIN PIPE (NON-PERF) 15 in  ","FT"]
[null,null,605.20018000000005,"UNDERDRAIN PIPE (NON-PERF) 18 in  ","FT"]
[null,null,605.20001999999999,"UNDERDRAIN PIPE (NON-PERF) 2 in  ","FT"]
[null,null,605.20024000000001,"UNDERDRAIN PIPE (NON-PERF) 24 in  ","FT"]
[null,null,605.20029999999997,"UNDERDRAIN PIPE (NON-PERF) 30 in  ","FT"]
[null,null,605.20036000000005,"UNDERDRAIN PIPE (NON-PERF) 36 in  ","FT"]
[null,null,605.20003999999994,"UNDERDRAIN PIPE (NON-PERF) 4 in  ","FT"]
[null,null,605.20006000000001,"UNDERDRAIN PIPE (NON-PERF) 6 in  ","FT"]
[null,null,605.20007999999996,"UNDERDRAIN PIPE (NON-PERF) 8 in  ","FT"]
[null,null,605.10001999999997,"UNDERDRAIN PIPE (PERF)  2 in  ","FT"]
[null,null,605.10004000000004,"UNDERDRAIN PIPE (PERF)  4 in  ","FT"]
[null,null,605.10005999999998,"UNDERDRAIN PIPE (PERF)  6 in  ","FT"]
[null,null,605.10008000000005,"UNDERDRAIN PIPE (PERF)  8 in  ","FT"]
[null,null,605.1001,"UNDERDRAIN PIPE (PERF) 10 in  ","FT"]
[null,null,605.10011999999995,"UNDERDRAIN PIPE (PERF) 12 in  ","FT"]
[null,null,605.10014999999999,"UNDERDRAIN PIPE (PERF) 15 in  ","FT"]
[null,null,605.10018000000002,"UNDERDRAIN PIPE (PERF) 18 in  ","FT"]
[null,null,701.76,"UNDERPASS LIGHTING SYSTEM","LS"]
[null,null,701.65099999999995,"UNDERPASS LUMINAIRE","EA"]
[null,"S",217.01054999999999,"UNIAXIAL GEOGRID TYPE I","SY"]
[null,"S",217.01060000000001,"UNIAXIAL GEOGRID TYPE II","SY"]
[null,null,606.06700000000001,"UPGRADE BOX BEAM GUARDRAIL","FT"]
[null,null,606.06709999999998,"UPGRADE BOX BEAM MED BARRIER","FT"]
[null,null,606.04304999999999,"UPGRADE CORR BEAM GUARDRAIL","FT"]
[null,null,606.04309999999998,"UPGRADE CORR BEAM MED BARRIER","FT"]
[null,null,620.06002999999998,"VALVE BOXES  3 in ","EA"]
[null,null,620.06003999999996,"VALVE BOXES  4 in ","EA"]
[null,null,620.06006000000002,"VALVE BOXES  6 in ","EA"]
[null,null,620.06007999999997,"VALVE BOXES  8 in ","EA"]
[null,null,620.06010000000003,"VALVE BOXES 10 in ","EA"]
[null,null,620.06011999999998,"VALVE BOXES 12 in ","EA"]
[null,null,620.06014000000005,"VALVE BOXES 14 in ","EA"]
[null,"S",701.87,"VMS SYSTEM CENTRAL CONTROLLER","EA"]
[null,"S",701.88,"VMS SYSTEM REMOTE CONTROLLER","EA"]
[null,"S",401.02010000000001,"WARM PLANT MIX","TON"]
[null,"S",401.02015,"WARM PLANT MIX (RECYCLE)","TON"]
[null,"S",401.02055999999999,"WARM PLANT MIX APPROACHES","TON"]
[null,"S",401.02030999999999,"WARM PLANT MIX LEVELING","TON"]
[null,"S",404.01002,"WARM PLANT MIX WEARING COURSE","TON"]
[null,"S",621.02121,"WASTE WATER SYSTEM","LS"]
[null,null,209.01,"WATER","MG"]
[null,"S",699.06,"WATER AND SEWER LINES ADJUSTMENT","LS"]
[null,"S",699.06005000000005,"WATER LINE","FT"]
[null,"S",699.06015000000002,"WATER MAIN REPLACEMENT","LS"]
[null,"S",699.06010000000003,"WATER SERVICE LINE","EA"]
[null,"SD",620.07029999999997,"WATER SYSTEMS","LS"]
[null,"S",699.06020000000001,"WATER TAP REPLACEMENT","LS"]
[null,"S",699.04001000000005,"WATER VALVES  1 in ","EA"]
[null,"S",699.04003999999998,"WATER VALVES  4 in ","EA"]
[null,"S",699.04006000000004,"WATER VALVES  6 in ","EA"]
[null,"S",699.04007999999999,"WATER VALVES  8 in  ","EA"]
[null,"S",699.04010000000005,"WATER VALVES 10 in ","EA"]
[null,"S",699.04012,"WATER VALVES 12 in ","EA"]
[null,"S",699.04013999999995,"WATER VALVES 14 in ","EA"]
[null,"S",699.04024000000004,"WATER VALVES 24 in ","EA"]
[null,"S",703.10805100000005,"WC-3 BARRICADE SIGNS (ANCHORED)","EA"]
[null,"S",703.10810000000004,"WC-4 BARRICADE SIGNS (ANCHORED)","EA"]
[null,"S",699.01044999999999,"WEIGH SCALES","LS"]
[null,null,612.00008000000003,"WELDED STL SIPHON PIPE  8 in ","FT"]
[null,null,612.00009999999997,"WELDED STL SIPHON PIPE 10 in ","FT"]
[null,null,612.00012000000004,"WELDED STL SIPHON PIPE 12 in ","FT"]
[null,null,612.00018,"WELDED STL SIPHON PIPE 18 in ","FT"]
[null,null,612.00023999999996,"WELDED STL SIPHON PIPE 24 in ","FT"]
[null,null,612.00030000000004,"WELDED STL SIPHON PIPE 30 in ","FT"]
[null,null,612.00036,"WELDED STL SIPHON PIPE 36 in ","FT"]
[null,null,612.00041999999996,"WELDED STL SIPHON PIPE 42 in ","FT"]
[null,null,612.00048000000004,"WELDED STL SIPHON PIPE 48 in ","FT"]
[null,null,612.00059999999996,"WELDED STL SIPHON PIPE 60 in ","FT"]
[null,null,212.02199999999999,"WET EXCAVATION","CY"]
[null,"S",216.03971999999999,"WETLAND CONSTRUCTION ","$$"]
[null,"S",216.03972999999999,"WETLAND CONSTRUCTION ","LS"]
[null,null,511.07,"WIRE-ENCL RIPRAP","SY"]
[null,"S",299.03699999999998,"WOOD CHIPS","CY"]
[]
[]
[]
[]
[]
[]
[]
[]
[]
[]
[]
[]
[]
[]
[]
[]
[]
[]
[]
[]
[]
[]
[]
[]
[]
[]
[]
[]
[]
[]
[]
[]
[]
[]
[]
[]
[]
[]
[]
[]
[]
[]
[]
[]
[]
[]
[]
[]
[]
[]
[]
[]
[]
[]
[]
[]
[]
[]
[]
[]
[]
[]
[]
[]
[]
[]
["A"]
[]
[]
[]
[]
[]
[]
[]
[]
[]
[]
[]
[]
[]
[]
[]
[]
[]
[]
[]
[]
[]
[]
[]
[]
[]
[]
["A"]